FailedConsole Output

Started by GitHub push by EHJ-52n
Building in workspace /var/lib/jenkins/workspace/sos-importer
 > git rev-parse --is-inside-work-tree # timeout=10
Fetching changes from the remote Git repository
 > git config remote.origin.url https://github.com/52North/sos-importer.git # timeout=10
Fetching upstream changes from https://github.com/52North/sos-importer.git
 > git --version # timeout=10
 > git fetch --tags --progress https://github.com/52North/sos-importer.git +refs/heads/*:refs/remotes/origin/*
 > git rev-parse origin/develop^{commit} # timeout=10
Checking out Revision 96dfabc73f3db27e9b739e78226f441ebf53419b (origin/develop)
 > git config core.sparsecheckout # timeout=10
 > git checkout -f 96dfabc73f3db27e9b739e78226f441ebf53419b
 > git rev-list e89e04bfed4829d58f719ac6b17a2056020c61ab # timeout=10
 > git tag -a -f -m Jenkins Build #357 jenkins-sos-importer-357 # timeout=10
Parsing POMs
Modules changed, recalculating dependency graph
Established TCP socket on 48924
[sos-importer] $ /var/lib/jenkins/tools/hudson.model.JDK/Java-1.8/bin/java -Xmx512m -XX:MaxPermSize=512m -cp /var/lib/jenkins/plugins/maven-plugin/WEB-INF/lib/maven3-agent-1.8.1.jar:/var/lib/jenkins/tools/hudson.tasks.Maven_MavenInstallation/Maven_3.0.x/boot/plexus-classworlds-2.4.jar org.jvnet.hudson.maven3.agent.Maven3Main /var/lib/jenkins/tools/hudson.tasks.Maven_MavenInstallation/Maven_3.0.x /var/cache/jenkins/war/WEB-INF/lib/remoting-3.1.jar /var/lib/jenkins/plugins/maven-plugin/WEB-INF/lib/maven3-interceptor-1.8.1.jar /var/lib/jenkins/plugins/maven-plugin/WEB-INF/lib/maven3-interceptor-commons-1.8.1.jar 48924
Java HotSpot(TM) 64-Bit Server VM warning: ignoring option MaxPermSize=512m; support was removed in 8.0
<===[JENKINS REMOTING CAPACITY]===>channel started
Executing Maven:  -B -f /var/lib/jenkins/workspace/sos-importer/pom.xml clean install -Denv=ci
[INFO] Scanning for projects...
[INFO] ------------------------------------------------------------------------
[INFO] Reactor Build Order:
[INFO] 
[INFO] 52North SOS-Importer
[INFO] XMLbeans Module
[INFO] Wizard Module
[INFO] Feeding Module
[INFO]                                                                         
[INFO] ------------------------------------------------------------------------
[INFO] Building 52North SOS-Importer 0.5.0-SNAPSHOT
[INFO] ------------------------------------------------------------------------
[INFO] 
[INFO] --- maven-clean-plugin:2.4.1:clean (default-clean) @ 52n-sos-importer ---
[INFO] 
[INFO] --- maven-install-plugin:2.3.1:install (default-install) @ 52n-sos-importer ---
[INFO] Installing /var/lib/jenkins/workspace/sos-importer/pom.xml to /var/lib/jenkins/.m2/repository/org/n52/sensorweb/52n-sos-importer/0.5.0-SNAPSHOT/52n-sos-importer-0.5.0-SNAPSHOT.pom
[INFO]                                                                         
[INFO] ------------------------------------------------------------------------
[INFO] Building XMLbeans Module 0.5.0-SNAPSHOT
[INFO] ------------------------------------------------------------------------
[INFO] 
[INFO] --- maven-clean-plugin:2.4.1:clean (default-clean) @ 52n-sos-importer-bindings ---
[INFO] Deleting /var/lib/jenkins/workspace/sos-importer/bindings/target
[INFO] 
[INFO] --- license-maven-plugin:2.6:check (check-license) @ 52n-sos-importer-bindings ---
[INFO] Checking licenses...
[INFO] 
[INFO] --- xmlbeans-maven-plugin:2.3.3:xmlbeans (main) @ 52n-sos-importer-bindings ---
[INFO] 
[INFO] --- maven-resources-plugin:2.5:resources (default-resources) @ 52n-sos-importer-bindings ---
[debug] execute contextualize
[INFO] Using 'UTF-8' encoding to copy filtered resources.
[INFO] Copying 2 resources
[INFO] Copying 749 resources
[INFO] 
[INFO] --- maven-compiler-plugin:2.3.2:compile (default-compile) @ 52n-sos-importer-bindings ---
[INFO] Nothing to compile - all classes are up to date
[INFO] 
[INFO] --- maven-resources-plugin:2.5:testResources (default-testResources) @ 52n-sos-importer-bindings ---
[debug] execute contextualize
[INFO] Using 'UTF-8' encoding to copy filtered resources.
[INFO] skip non existing resourceDirectory /var/lib/jenkins/workspace/sos-importer/bindings/src/test/resources
[INFO] 
[INFO] --- maven-compiler-plugin:2.3.2:testCompile (default-testCompile) @ 52n-sos-importer-bindings ---
[INFO] No sources to compile
[INFO] 
[INFO] --- maven-surefire-plugin:2.10:test (default-test) @ 52n-sos-importer-bindings ---
[INFO] No tests to run.
[INFO] Surefire report directory: /var/lib/jenkins/workspace/sos-importer/bindings/target/surefire-reports

-------------------------------------------------------
 T E S T S
-------------------------------------------------------

Results :

Tests run: 0, Failures: 0, Errors: 0, Skipped: 0

[JENKINS] Recording test results
[INFO] 
[INFO] --- maven-jar-plugin:2.3.2:jar (default-jar) @ 52n-sos-importer-bindings ---
[INFO] Building jar: /var/lib/jenkins/workspace/sos-importer/bindings/target/52n-sos-importer-bindings-0.5.0-SNAPSHOT.jar
[INFO] 
[INFO] --- maven-install-plugin:2.3.1:install (default-install) @ 52n-sos-importer-bindings ---
[INFO] Installing /var/lib/jenkins/workspace/sos-importer/bindings/target/52n-sos-importer-bindings-0.5.0-SNAPSHOT.jar to /var/lib/jenkins/.m2/repository/org/n52/sensorweb/52n-sos-importer-bindings/0.5.0-SNAPSHOT/52n-sos-importer-bindings-0.5.0-SNAPSHOT.jar
[INFO] Installing /var/lib/jenkins/workspace/sos-importer/bindings/pom.xml to /var/lib/jenkins/.m2/repository/org/n52/sensorweb/52n-sos-importer-bindings/0.5.0-SNAPSHOT/52n-sos-importer-bindings-0.5.0-SNAPSHOT.pom
[INFO]                                                                         
[INFO] ------------------------------------------------------------------------
[INFO] Building Wizard Module 0.5.0-SNAPSHOT
[INFO] ------------------------------------------------------------------------
[INFO] 
[INFO] --- maven-clean-plugin:2.4.1:clean (default-clean) @ 52n-sos-importer-wizard ---
[INFO] 
[INFO] --- license-maven-plugin:2.6:check (check-license) @ 52n-sos-importer-wizard ---
[INFO] Checking licenses...
[WARNING] Missing header in: /var/lib/jenkins/workspace/sos-importer/wizard/src/test/java/org/n52/sos/importer/model/xml/Step5CModelHandlerTest.java
[INFO] ------------------------------------------------------------------------
[INFO] Reactor Summary:
[INFO] 
[INFO] 52North SOS-Importer .............................. SUCCESS [0.521s]
[INFO] XMLbeans Module ................................... SUCCESS [4.277s]
[INFO] Wizard Module ..................................... FAILURE [0.220s]
[INFO] Feeding Module .................................... SKIPPED
[INFO] ------------------------------------------------------------------------
[INFO] BUILD FAILURE
[INFO] ------------------------------------------------------------------------
[INFO] Total time: 5.752s
[INFO] Finished at: Wed Dec 07 08:51:30 UTC 2016
[INFO] Final Memory: 20M/212M
[INFO] ------------------------------------------------------------------------
[ERROR] Failed to execute goal com.mycila:license-maven-plugin:2.6:check (check-license) on project 52n-sos-importer-wizard: Some files do not have the expected license header -> [Help 1]
[ERROR] 
[ERROR] To see the full stack trace of the errors, re-run Maven with the -e switch.
[ERROR] Re-run Maven using the -X switch to enable full debug logging.
[ERROR] 
[ERROR] For more information about the errors and possible solutions, please read the following articles:
[ERROR] [Help 1] http://cwiki.apache.org/confluence/display/MAVEN/MojoExecutionException
[ERROR] 
[ERROR] After correcting the problems, you can resume the build with the command
[ERROR]   mvn <goals> -rf :52n-sos-importer-wizard
[JENKINS] Archiving /var/lib/jenkins/workspace/sos-importer/wizard/pom.xml to org.n52.sensorweb/52n-sos-importer-wizard/0.5.0-SNAPSHOT/52n-sos-importer-wizard-0.5.0-SNAPSHOT.pom
[JENKINS] Archiving /var/lib/jenkins/workspace/sos-importer/pom.xml to org.n52.sensorweb/52n-sos-importer/0.5.0-SNAPSHOT/52n-sos-importer-0.5.0-SNAPSHOT.pom
[JENKINS] Archiving /var/lib/jenkins/workspace/sos-importer/feeder/pom.xml to org.n52.sensorweb/52n-sos-importer-feeder/0.5.0-SNAPSHOT/52n-sos-importer-feeder-0.5.0-SNAPSHOT.pom
[JENKINS] Archiving /var/lib/jenkins/workspace/sos-importer/bindings/pom.xml to org.n52.sensorweb/52n-sos-importer-bindings/0.5.0-SNAPSHOT/52n-sos-importer-bindings-0.5.0-SNAPSHOT.pom
[JENKINS] Archiving /var/lib/jenkins/workspace/sos-importer/bindings/target/52n-sos-importer-bindings-0.5.0-SNAPSHOT.jar to org.n52.sensorweb/52n-sos-importer-bindings/0.5.0-SNAPSHOT/52n-sos-importer-bindings-0.5.0-SNAPSHOT.jar
channel stopped
Skipping sonar analysis due to bad build status FAILURE
Sending e-mails to: sensorweb-commits@52north.org
Finished: FAILURE