FailedConsole Output

Started by GitHub push by EHJ-52n
Building in workspace /var/lib/jenkins/workspace/sos-importer
 > git rev-parse --is-inside-work-tree # timeout=10
Fetching changes from the remote Git repository
 > git config remote.origin.url https://github.com/52North/sos-importer.git # timeout=10
Fetching upstream changes from https://github.com/52North/sos-importer.git
 > git --version # timeout=10
 > git -c core.askpass=true fetch --tags --progress https://github.com/52North/sos-importer.git +refs/heads/*:refs/remotes/origin/*
 > git rev-parse origin/develop^{commit} # timeout=10
Checking out Revision d678a8b6cabb1b43a6c2ee2a8a0c9db6e2a87bb4 (origin/develop)
 > git config core.sparsecheckout # timeout=10
 > git checkout -f d678a8b6cabb1b43a6c2ee2a8a0c9db6e2a87bb4
 > git rev-list b9f139ffb715c22b64fa6ff2384ad7a3eda7c279 # timeout=10
 > git tag -a -f -m Jenkins Build #347 jenkins-sos-importer-347 # timeout=10
Parsing POMs
Modules changed, recalculating dependency graph
[sos-importer] $ /var/lib/jenkins/tools/hudson.model.JDK/Java-1.7/bin/java -Xmx512m -XX:MaxPermSize=512m -cp /var/lib/jenkins/plugins/maven-plugin/WEB-INF/lib/maven32-agent-1.6.jar:/var/lib/jenkins/tools/hudson.tasks.Maven_MavenInstallation/Maven_3.0.x/boot/plexus-classworlds-2.5.1.jar:/var/lib/jenkins/tools/hudson.tasks.Maven_MavenInstallation/Maven_3.0.x/conf/logging jenkins.maven3.agent.Maven32Main /var/lib/jenkins/tools/hudson.tasks.Maven_MavenInstallation/Maven_3.0.x /var/cache/jenkins/war/WEB-INF/lib/remoting-2.51.jar /var/lib/jenkins/plugins/maven-plugin/WEB-INF/lib/maven32-interceptor-1.6.jar /var/lib/jenkins/plugins/maven-plugin/WEB-INF/lib/maven3-interceptor-commons-1.6.jar 33521
<===[JENKINS REMOTING CAPACITY]===>channel started
Executing Maven:  -B -f /var/lib/jenkins/workspace/sos-importer/pom.xml clean install -Denv=ci
[INFO] Scanning for projects...
[INFO] ------------------------------------------------------------------------
[INFO] Reactor Build Order:
[INFO] 
[INFO] 52North SOS-Importer
[INFO] XMLbeans Module
[INFO] Wizard Module
[INFO] Feeding Module
[INFO] 
[INFO] Using the builder org.apache.maven.lifecycle.internal.builder.singlethreaded.SingleThreadedBuilder with a thread count of 1
[INFO]                                                                         
[INFO] ------------------------------------------------------------------------
[INFO] Building 52North SOS-Importer 0.5.0-SNAPSHOT
[INFO] ------------------------------------------------------------------------
[INFO] 
[INFO] --- maven-clean-plugin:2.5:clean (default-clean) @ 52n-sos-importer ---
[INFO] Deleting /var/lib/jenkins/workspace/sos-importer/target
[INFO] 
[INFO] --- maven-install-plugin:2.4:install (default-install) @ 52n-sos-importer ---
[INFO] Installing /var/lib/jenkins/workspace/sos-importer/pom.xml to /var/lib/jenkins/.m2/repository/org/n52/sensorweb/52n-sos-importer/0.5.0-SNAPSHOT/52n-sos-importer-0.5.0-SNAPSHOT.pom
[INFO]                                                                         
[INFO] ------------------------------------------------------------------------
[INFO] Building XMLbeans Module 0.5.0-SNAPSHOT
[INFO] ------------------------------------------------------------------------
[INFO] 
[INFO] --- maven-clean-plugin:2.5:clean (default-clean) @ 52n-sos-importer-bindings ---
[INFO] Deleting /var/lib/jenkins/workspace/sos-importer/bindings/target
[INFO] 
[INFO] --- license-maven-plugin:2.6:check (check-license) @ 52n-sos-importer-bindings ---
[INFO] Checking licenses...
[INFO] 
[INFO] --- xmlbeans-maven-plugin:2.3.3:xmlbeans (main) @ 52n-sos-importer-bindings ---
[INFO] 
[INFO] --- maven-resources-plugin:2.6:resources (default-resources) @ 52n-sos-importer-bindings ---
[INFO] Using 'UTF-8' encoding to copy filtered resources.
[INFO] Copying 2 resources
[INFO] Copying 749 resources
[INFO] 
[INFO] --- maven-compiler-plugin:2.5.1:compile (default-compile) @ 52n-sos-importer-bindings ---
[INFO] Nothing to compile - all classes are up to date
[INFO] 
[INFO] --- maven-resources-plugin:2.6:testResources (default-testResources) @ 52n-sos-importer-bindings ---
[INFO] Using 'UTF-8' encoding to copy filtered resources.
[INFO] skip non existing resourceDirectory /var/lib/jenkins/workspace/sos-importer/bindings/src/test/resources
[INFO] 
[INFO] --- maven-compiler-plugin:2.5.1:testCompile (default-testCompile) @ 52n-sos-importer-bindings ---
[INFO] No sources to compile
[INFO] 
[INFO] --- maven-surefire-plugin:2.12.4:test (default-test) @ 52n-sos-importer-bindings ---
[INFO] No tests to run.
[JENKINS] Recording test results
[INFO] 
[INFO] --- maven-jar-plugin:2.4:jar (default-jar) @ 52n-sos-importer-bindings ---
[INFO] Building jar: /var/lib/jenkins/workspace/sos-importer/bindings/target/52n-sos-importer-bindings-0.5.0-SNAPSHOT.jar
[INFO] 
[INFO] --- maven-install-plugin:2.4:install (default-install) @ 52n-sos-importer-bindings ---
[INFO] Installing /var/lib/jenkins/workspace/sos-importer/bindings/target/52n-sos-importer-bindings-0.5.0-SNAPSHOT.jar to /var/lib/jenkins/.m2/repository/org/n52/sensorweb/52n-sos-importer-bindings/0.5.0-SNAPSHOT/52n-sos-importer-bindings-0.5.0-SNAPSHOT.jar
[INFO] Installing /var/lib/jenkins/workspace/sos-importer/bindings/pom.xml to /var/lib/jenkins/.m2/repository/org/n52/sensorweb/52n-sos-importer-bindings/0.5.0-SNAPSHOT/52n-sos-importer-bindings-0.5.0-SNAPSHOT.pom
[INFO]                                                                         
[INFO] ------------------------------------------------------------------------
[INFO] Building Wizard Module 0.5.0-SNAPSHOT
[INFO] ------------------------------------------------------------------------
[INFO] 
[INFO] --- maven-clean-plugin:2.5:clean (default-clean) @ 52n-sos-importer-wizard ---
[INFO] Deleting /var/lib/jenkins/workspace/sos-importer/wizard/target
[INFO] 
[INFO] --- license-maven-plugin:2.6:check (check-license) @ 52n-sos-importer-wizard ---
[INFO] Checking licenses...
[INFO] 
[INFO] --- maven-resources-plugin:2.6:resources (default-resources) @ 52n-sos-importer-wizard ---
[INFO] Using 'UTF-8' encoding to copy filtered resources.
[INFO] Copying 14 resources
[INFO] 
[INFO] --- maven-compiler-plugin:2.5.1:compile (default-compile) @ 52n-sos-importer-wizard ---
[INFO] Compiling 140 source files to /var/lib/jenkins/workspace/sos-importer/wizard/target/classes
[INFO] 
[INFO] --- maven-resources-plugin:2.6:testResources (default-testResources) @ 52n-sos-importer-wizard ---
[INFO] Using 'UTF-8' encoding to copy filtered resources.
[INFO] Copying 1 resource
[INFO] 
[INFO] --- maven-compiler-plugin:2.5.1:testCompile (default-testCompile) @ 52n-sos-importer-wizard ---
[INFO] Compiling 32 source files to /var/lib/jenkins/workspace/sos-importer/wizard/target/test-classes
[INFO] 
[INFO] --- maven-surefire-plugin:2.12.4:test (default-test) @ 52n-sos-importer-wizard ---
[INFO] Surefire report directory: /var/lib/jenkins/workspace/sos-importer/wizard/target/surefire-reports

-------------------------------------------------------
 T E S T S
-------------------------------------------------------
Running org.n52.sos.importer.model.Step2ModelTest
15:18:05,742 |-INFO in ch.qos.logback.classic.LoggerContext[default] - Could NOT find resource [logback.groovy]
15:18:05,743 |-INFO in ch.qos.logback.classic.LoggerContext[default] - Could NOT find resource [logback-test.xml]
15:18:05,743 |-INFO in ch.qos.logback.classic.LoggerContext[default] - Found resource [logback.xml] at [file:/var/lib/jenkins/workspace/sos-importer/wizard/target/test-classes/logback.xml]
15:18:05,744 |-WARN in ch.qos.logback.classic.LoggerContext[default] - Resource [logback.xml] occurs multiple times on the classpath.
15:18:05,744 |-WARN in ch.qos.logback.classic.LoggerContext[default] - Resource [logback.xml] occurs at [file:/var/lib/jenkins/workspace/sos-importer/wizard/target/classes/logback.xml]
15:18:05,744 |-WARN in ch.qos.logback.classic.LoggerContext[default] - Resource [logback.xml] occurs at [file:/var/lib/jenkins/workspace/sos-importer/wizard/target/test-classes/logback.xml]
15:18:05,905 |-INFO in ch.qos.logback.classic.joran.action.ConfigurationAction - debug attribute not set
15:18:05,911 |-INFO in ch.qos.logback.classic.joran.action.ConfigurationAction - Setting ReconfigureOnChangeFilter scanning period to 30 seconds
15:18:05,911 |-INFO in ReconfigureOnChangeFilter{invocationCounter=0} - Will scan for changes in [[/var/lib/jenkins/workspace/sos-importer/wizard/target/test-classes/logback.xml]] every 30 seconds. 
15:18:05,911 |-INFO in ch.qos.logback.classic.joran.action.ConfigurationAction - Adding ReconfigureOnChangeFilter as a turbo filter
15:18:05,917 |-INFO in ch.qos.logback.core.joran.action.AppenderAction - About to instantiate appender of type [ch.qos.logback.core.rolling.RollingFileAppender]
15:18:05,920 |-INFO in ch.qos.logback.core.joran.action.AppenderAction - Naming appender as [FILE]
15:18:05,946 |-WARN in ch.qos.logback.core.joran.util.PropertySetter@44b1d518 - Failed to set property [maxHistory] to value "config.logger.history.max_IS_UNDEFINED".  ch.qos.logback.core.util.PropertySetterException: Conversion to type [int] failed. 
	at ch.qos.logback.core.util.PropertySetterException: Conversion to type [int] failed. 
	at 	at ch.qos.logback.core.joran.util.PropertySetter.setProperty(PropertySetter.java:159)
	at 	at ch.qos.logback.core.joran.util.PropertySetter.setProperty(PropertySetter.java:120)
	at 	at ch.qos.logback.core.joran.action.NestedBasicPropertyIA.body(NestedBasicPropertyIA.java:92)
	at 	at ch.qos.logback.core.joran.spi.Interpreter.callBodyAction(Interpreter.java:295)
	at 	at ch.qos.logback.core.joran.spi.Interpreter.characters(Interpreter.java:175)
	at 	at ch.qos.logback.core.joran.spi.EventPlayer.play(EventPlayer.java:57)
	at 	at ch.qos.logback.core.joran.GenericConfigurator.doConfigure(GenericConfigurator.java:149)
	at 	at ch.qos.logback.core.joran.GenericConfigurator.doConfigure(GenericConfigurator.java:135)
	at 	at ch.qos.logback.core.joran.GenericConfigurator.doConfigure(GenericConfigurator.java:99)
	at 	at ch.qos.logback.core.joran.GenericConfigurator.doConfigure(GenericConfigurator.java:49)
	at 	at ch.qos.logback.classic.util.ContextInitializer.configureByResource(ContextInitializer.java:75)
	at 	at ch.qos.logback.classic.util.ContextInitializer.autoConfig(ContextInitializer.java:148)
	at 	at org.slf4j.impl.StaticLoggerBinder.init(StaticLoggerBinder.java:85)
	at 	at org.slf4j.impl.StaticLoggerBinder.<clinit>(StaticLoggerBinder.java:55)
	at 	at org.slf4j.LoggerFactory.bind(LoggerFactory.java:128)
	at 	at org.slf4j.LoggerFactory.performInitialization(LoggerFactory.java:107)
	at 	at org.slf4j.LoggerFactory.getILoggerFactory(LoggerFactory.java:295)
	at 	at org.slf4j.LoggerFactory.getLogger(LoggerFactory.java:269)
	at 	at org.slf4j.LoggerFactory.getLogger(LoggerFactory.java:281)
	at 	at org.n52.sos.importer.view.combobox.ComboBoxItems.<clinit>(ComboBoxItems.java:53)
	at 	at org.n52.sos.importer.view.combobox.EditableComboBoxItems.<init>(EditableComboBoxItems.java:75)
	at 	at org.n52.sos.importer.view.combobox.EditableComboBoxItems.getInstance(EditableComboBoxItems.java:112)
	at 	at org.n52.sos.importer.model.Step2Model.<init>(Step2Model.java:70)
	at 	at org.n52.sos.importer.model.Step2ModelTest.init(Step2ModelTest.java:46)
	at 	at sun.reflect.NativeMethodAccessorImpl.invoke0(Native Method)
	at 	at sun.reflect.NativeMethodAccessorImpl.invoke(NativeMethodAccessorImpl.java:57)
	at 	at sun.reflect.DelegatingMethodAccessorImpl.invoke(DelegatingMethodAccessorImpl.java:43)
	at 	at java.lang.reflect.Method.invoke(Method.java:606)
	at 	at org.junit.runners.model.FrameworkMethod$1.runReflectiveCall(FrameworkMethod.java:45)
	at 	at org.junit.internal.runners.model.ReflectiveCallable.run(ReflectiveCallable.java:15)
	at 	at org.junit.runners.model.FrameworkMethod.invokeExplosively(FrameworkMethod.java:42)
	at 	at org.junit.internal.runners.statements.RunBefores.evaluate(RunBefores.java:27)
	at 	at org.junit.runners.ParentRunner.runLeaf(ParentRunner.java:263)
	at 	at org.junit.runners.BlockJUnit4ClassRunner.runChild(BlockJUnit4ClassRunner.java:68)
	at 	at org.junit.runners.BlockJUnit4ClassRunner.runChild(BlockJUnit4ClassRunner.java:47)
	at 	at org.junit.runners.ParentRunner$3.run(ParentRunner.java:231)
	at 	at org.junit.runners.ParentRunner$1.schedule(ParentRunner.java:60)
	at 	at org.junit.runners.ParentRunner.runChildren(ParentRunner.java:229)
	at 	at org.junit.runners.ParentRunner.access$000(ParentRunner.java:50)
	at 	at org.junit.runners.ParentRunner$2.evaluate(ParentRunner.java:222)
	at 	at org.junit.runners.ParentRunner.run(ParentRunner.java:300)
	at 	at org.apache.maven.surefire.junit4.JUnit4Provider.execute(JUnit4Provider.java:252)
	at 	at org.apache.maven.surefire.junit4.JUnit4Provider.executeTestSet(JUnit4Provider.java:141)
	at 	at org.apache.maven.surefire.junit4.JUnit4Provider.invoke(JUnit4Provider.java:112)
	at 	at sun.reflect.NativeMethodAccessorImpl.invoke0(Native Method)
	at 	at sun.reflect.NativeMethodAccessorImpl.invoke(NativeMethodAccessorImpl.java:57)
	at 	at sun.reflect.DelegatingMethodAccessorImpl.invoke(DelegatingMethodAccessorImpl.java:43)
	at 	at java.lang.reflect.Method.invoke(Method.java:606)
	at 	at org.apache.maven.surefire.util.ReflectionUtils.invokeMethodWithArray(ReflectionUtils.java:189)
	at 	at org.apache.maven.surefire.booter.ProviderFactory$ProviderProxy.invoke(ProviderFactory.java:165)
	at 	at org.apache.maven.surefire.booter.ProviderFactory.invokeProvider(ProviderFactory.java:85)
	at 	at org.apache.maven.surefire.booter.ForkedBooter.runSuitesInProcess(ForkedBooter.java:115)
	at 	at org.apache.maven.surefire.booter.ForkedBooter.main(ForkedBooter.java:75)
Caused by: java.lang.NumberFormatException: For input string: "config.logger.history.max_IS_UNDEFINED"
	at 	at java.lang.NumberFormatException.forInputString(NumberFormatException.java:65)
	at 	at java.lang.Integer.parseInt(Integer.java:492)
	at 	at java.lang.Integer.<init>(Integer.java:677)
	at 	at ch.qos.logback.core.joran.util.StringToObjectConverter.convertArg(StringToObjectConverter.java:61)
	at 	at ch.qos.logback.core.joran.util.PropertySetter.setProperty(PropertySetter.java:157)
	at 	... 52 common frames omitted
15:18:05,951 |-WARN in ch.qos.logback.core.joran.util.PropertySetter@5edc2a37 - Failed to set property [maxFileSize] to value "config.logger.maxFileSize_IS_UNDEFINED".  ch.qos.logback.core.util.PropertySetterException: java.lang.reflect.InvocationTargetException
	at ch.qos.logback.core.util.PropertySetterException: java.lang.reflect.InvocationTargetException
	at 	at ch.qos.logback.core.joran.util.PropertySetter.setProperty(PropertySetter.java:170)
	at 	at ch.qos.logback.core.joran.util.PropertySetter.setProperty(PropertySetter.java:120)
	at 	at ch.qos.logback.core.joran.action.NestedBasicPropertyIA.body(NestedBasicPropertyIA.java:92)
	at 	at ch.qos.logback.core.joran.spi.Interpreter.callBodyAction(Interpreter.java:295)
	at 	at ch.qos.logback.core.joran.spi.Interpreter.characters(Interpreter.java:175)
	at 	at ch.qos.logback.core.joran.spi.EventPlayer.play(EventPlayer.java:57)
	at 	at ch.qos.logback.core.joran.GenericConfigurator.doConfigure(GenericConfigurator.java:149)
	at 	at ch.qos.logback.core.joran.GenericConfigurator.doConfigure(GenericConfigurator.java:135)
	at 	at ch.qos.logback.core.joran.GenericConfigurator.doConfigure(GenericConfigurator.java:99)
	at 	at ch.qos.logback.core.joran.GenericConfigurator.doConfigure(GenericConfigurator.java:49)
	at 	at ch.qos.logback.classic.util.ContextInitializer.configureByResource(ContextInitializer.java:75)
	at 	at ch.qos.logback.classic.util.ContextInitializer.autoConfig(ContextInitializer.java:148)
	at 	at org.slf4j.impl.StaticLoggerBinder.init(StaticLoggerBinder.java:85)
	at 	at org.slf4j.impl.StaticLoggerBinder.<clinit>(StaticLoggerBinder.java:55)
	at 	at org.slf4j.LoggerFactory.bind(LoggerFactory.java:128)
	at 	at org.slf4j.LoggerFactory.performInitialization(LoggerFactory.java:107)
	at 	at org.slf4j.LoggerFactory.getILoggerFactory(LoggerFactory.java:295)
	at 	at org.slf4j.LoggerFactory.getLogger(LoggerFactory.java:269)
	at 	at org.slf4j.LoggerFactory.getLogger(LoggerFactory.java:281)
	at 	at org.n52.sos.importer.view.combobox.ComboBoxItems.<clinit>(ComboBoxItems.java:53)
	at 	at org.n52.sos.importer.view.combobox.EditableComboBoxItems.<init>(EditableComboBoxItems.java:75)
	at 	at org.n52.sos.importer.view.combobox.EditableComboBoxItems.getInstance(EditableComboBoxItems.java:112)
	at 	at org.n52.sos.importer.model.Step2Model.<init>(Step2Model.java:70)
	at 	at org.n52.sos.importer.model.Step2ModelTest.init(Step2ModelTest.java:46)
	at 	at sun.reflect.NativeMethodAccessorImpl.invoke0(Native Method)
	at 	at sun.reflect.NativeMethodAccessorImpl.invoke(NativeMethodAccessorImpl.java:57)
	at 	at sun.reflect.DelegatingMethodAccessorImpl.invoke(DelegatingMethodAccessorImpl.java:43)
	at 	at java.lang.reflect.Method.invoke(Method.java:606)
	at 	at org.junit.runners.model.FrameworkMethod$1.runReflectiveCall(FrameworkMethod.java:45)
	at 	at org.junit.internal.runners.model.ReflectiveCallable.run(ReflectiveCallable.java:15)
	at 	at org.junit.runners.model.FrameworkMethod.invokeExplosively(FrameworkMethod.java:42)
	at 	at org.junit.internal.runners.statements.RunBefores.evaluate(RunBefores.java:27)
	at 	at org.junit.runners.ParentRunner.runLeaf(ParentRunner.java:263)
	at 	at org.junit.runners.BlockJUnit4ClassRunner.runChild(BlockJUnit4ClassRunner.java:68)
	at 	at org.junit.runners.BlockJUnit4ClassRunner.runChild(BlockJUnit4ClassRunner.java:47)
	at 	at org.junit.runners.ParentRunner$3.run(ParentRunner.java:231)
	at 	at org.junit.runners.ParentRunner$1.schedule(ParentRunner.java:60)
	at 	at org.junit.runners.ParentRunner.runChildren(ParentRunner.java:229)
	at 	at org.junit.runners.ParentRunner.access$000(ParentRunner.java:50)
	at 	at org.junit.runners.ParentRunner$2.evaluate(ParentRunner.java:222)
	at 	at org.junit.runners.ParentRunner.run(ParentRunner.java:300)
	at 	at org.apache.maven.surefire.junit4.JUnit4Provider.execute(JUnit4Provider.java:252)
	at 	at org.apache.maven.surefire.junit4.JUnit4Provider.executeTestSet(JUnit4Provider.java:141)
	at 	at org.apache.maven.surefire.junit4.JUnit4Provider.invoke(JUnit4Provider.java:112)
	at 	at sun.reflect.NativeMethodAccessorImpl.invoke0(Native Method)
	at 	at sun.reflect.NativeMethodAccessorImpl.invoke(NativeMethodAccessorImpl.java:57)
	at 	at sun.reflect.DelegatingMethodAccessorImpl.invoke(DelegatingMethodAccessorImpl.java:43)
	at 	at java.lang.reflect.Method.invoke(Method.java:606)
	at 	at org.apache.maven.surefire.util.ReflectionUtils.invokeMethodWithArray(ReflectionUtils.java:189)
	at 	at org.apache.maven.surefire.booter.ProviderFactory$ProviderProxy.invoke(ProviderFactory.java:165)
	at 	at org.apache.maven.surefire.booter.ProviderFactory.invokeProvider(ProviderFactory.java:85)
	at 	at org.apache.maven.surefire.booter.ForkedBooter.runSuitesInProcess(ForkedBooter.java:115)
	at 	at org.apache.maven.surefire.booter.ForkedBooter.main(ForkedBooter.java:75)
Caused by: java.lang.reflect.InvocationTargetException
	at 	at sun.reflect.NativeMethodAccessorImpl.invoke0(Native Method)
	at 	at sun.reflect.NativeMethodAccessorImpl.invoke(NativeMethodAccessorImpl.java:57)
	at 	at sun.reflect.DelegatingMethodAccessorImpl.invoke(DelegatingMethodAccessorImpl.java:43)
	at 	at java.lang.reflect.Method.invoke(Method.java:606)
	at 	at ch.qos.logback.core.joran.util.PropertySetter.setProperty(PropertySetter.java:168)
	at 	... 52 common frames omitted
Caused by: java.lang.IllegalArgumentException: String value [config.logger.maxFileSize_IS_UNDEFINED] is not in the expected format.
	at 	at ch.qos.logback.core.util.FileSize.valueOf(FileSize.java:79)
	at 	at ch.qos.logback.core.rolling.SizeAndTimeBasedFNATP.setMaxFileSize(SizeAndTimeBasedFNATP.java:131)
	at 	... 57 common frames omitted
15:18:05,975 |-INFO in c.q.l.core.rolling.TimeBasedRollingPolicy - No compression will be used
15:18:05,977 |-INFO in c.q.l.core.rolling.TimeBasedRollingPolicy - Will use the pattern logs/sos-importer-core/%d{yyyy-MM-dd}-%i.log for the active file
15:18:05,979 |-INFO in ch.qos.logback.core.rolling.SizeAndTimeBasedFNATP@4857b188 - The date pattern is 'yyyy-MM-dd' from file name pattern 'logs/sos-importer-core/%d{yyyy-MM-dd}-%i.log'.
15:18:05,979 |-INFO in ch.qos.logback.core.rolling.SizeAndTimeBasedFNATP@4857b188 - Roll-over at midnight.
15:18:05,981 |-INFO in ch.qos.logback.core.rolling.SizeAndTimeBasedFNATP@4857b188 - Setting initial period to Mon May 18 12:39:33 CEST 2015
15:18:05,983 |-INFO in ch.qos.logback.core.joran.action.NestedComplexPropertyIA - Assuming default type [ch.qos.logback.classic.encoder.PatternLayoutEncoder] for [encoder] property
15:18:06,002 |-INFO in ch.qos.logback.core.rolling.RollingFileAppender[FILE] - Active log file name: logs/sos-importer-core.log
15:18:06,002 |-INFO in ch.qos.logback.core.rolling.RollingFileAppender[FILE] - File property is set to [logs/sos-importer-core.log]
15:18:06,002 |-INFO in ch.qos.logback.core.joran.action.AppenderAction - About to instantiate appender of type [ch.qos.logback.core.ConsoleAppender]
15:18:06,004 |-INFO in ch.qos.logback.core.joran.action.AppenderAction - Naming appender as [STDOUT]
15:18:06,005 |-INFO in ch.qos.logback.core.joran.action.NestedComplexPropertyIA - Assuming default type [ch.qos.logback.classic.encoder.PatternLayoutEncoder] for [encoder] property
15:18:06,007 |-INFO in ch.qos.logback.classic.joran.action.LoggerAction - Setting level of logger [org.n52] to TRACE
15:18:06,007 |-INFO in ch.qos.logback.classic.joran.action.RootLoggerAction - Setting level of ROOT logger to INFO
15:18:06,008 |-INFO in ch.qos.logback.core.joran.action.AppenderRefAction - Attaching appender named [FILE] to Logger[ROOT]
15:18:06,008 |-INFO in ch.qos.logback.core.joran.action.AppenderRefAction - Attaching appender named [STDOUT] to Logger[ROOT]
15:18:06,008 |-INFO in ch.qos.logback.classic.joran.action.ConfigurationAction - End of configuration.
15:18:06,009 |-INFO in ch.qos.logback.classic.joran.JoranConfigurator@75487cd2 - Registering current configuration as safe fallback point

15:18:06.016 [main] INFO  ComboBoxItems - Load default settings from jar file
Tests run: 16, Failures: 0, Errors: 0, Skipped: 0, Time elapsed: 0.359 sec
Running org.n52.sos.importer.model.xml.Step7ModelHandlerTest
15:18:06.201 [main] TRACE Step7ModelHandler - handleModel()
15:18:06.206 [main] DEBUG Step7ModelHandler - Added new SosMetadata element.
15:18:06.215 [main] DEBUG Step7ModelHandler - Added new Offering element
15:18:06.227 [main] TRACE Step7ModelHandler - handleModel()
15:18:06.227 [main] DEBUG Step7ModelHandler - Added new SosMetadata element.
15:18:06.227 [main] DEBUG Step7ModelHandler - Added new Offering element
15:18:06.228 [main] TRACE Step7ModelHandler - handleModel()
15:18:06.229 [main] DEBUG Step7ModelHandler - Added new SosMetadata element.
15:18:06.229 [main] DEBUG Step7ModelHandler - Added new Offering element
15:18:06.231 [main] TRACE Step7ModelHandler - handleModel()
15:18:06.231 [main] DEBUG Step7ModelHandler - Added new SosMetadata element.
15:18:06.232 [main] DEBUG Step7ModelHandler - Added new Offering element
15:18:06.232 [main] TRACE Step7ModelHandler - handleModel()
15:18:06.233 [main] DEBUG Step7ModelHandler - Added new SosMetadata element.
15:18:06.233 [main] DEBUG Step7ModelHandler - Added new Offering element
15:18:06.234 [main] TRACE Step7ModelHandler - handleModel()
15:18:06.234 [main] DEBUG Step7ModelHandler - Added new SosMetadata element.
15:18:06.235 [main] DEBUG Step7ModelHandler - Added new Offering element
15:18:06.239 [main] TRACE Step7ModelHandler - handleModel()
15:18:06.239 [main] DEBUG Step7ModelHandler - Added new SosMetadata element.
15:18:06.240 [main] DEBUG Step7ModelHandler - Added new Offering element
15:18:06.241 [main] TRACE Step7ModelHandler - handleModel()
15:18:06.241 [main] DEBUG Step7ModelHandler - Added new SosMetadata element.
15:18:06.242 [main] DEBUG Step7ModelHandler - Added new Offering element
Tests run: 6, Failures: 0, Errors: 0, Skipped: 0, Time elapsed: 0.206 sec
Running org.n52.sos.importer.model.xml.Step2ModelHandlerTest
15:18:06.244 [main] TRACE Step2ModelHandler - handleModel()
15:18:06.262 [main] TRACE Step2ModelHandler - handleModel()
15:18:06.263 [main] TRACE Step2ModelHandler - handleModel()
15:18:06.265 [main] TRACE Step2ModelHandler - handleModel()
15:18:06.267 [main] TRACE Step2ModelHandler - handleModel()
15:18:06.269 [main] TRACE Step2ModelHandler - handleModel()
15:18:06.270 [main] TRACE Step2ModelHandler - handleModel()
Tests run: 7, Failures: 0, Errors: 0, Skipped: 0, Time elapsed: 0.026 sec
Running org.n52.sos.importer.model.CsvDataTest
Tests run: 5, Failures: 0, Errors: 0, Skipped: 0, Time elapsed: 0 sec
Running org.n52.sos.importer.model.Step7ModelTest
Tests run: 6, Failures: 0, Errors: 0, Skipped: 0, Time elapsed: 0 sec
Running org.n52.sos.importer.view.Step7PanelTest
Tests run: 1, Failures: 0, Errors: 0, Skipped: 1, Time elapsed: 0 sec
Running org.n52.sos.importer.view.Step2PanelTest
Tests run: 1, Failures: 0, Errors: 0, Skipped: 1, Time elapsed: 0 sec
Running org.n52.sos.importer.controller.Step2ControllerTest
Tests run: 1, Failures: 0, Errors: 0, Skipped: 1, Time elapsed: 0 sec
Running org.n52.sos.importer.controller.Step7ControllerTest
Tests run: 1, Failures: 0, Errors: 0, Skipped: 1, Time elapsed: 0 sec

Results :

Tests run: 44, Failures: 0, Errors: 0, Skipped: 4

[JENKINS] Recording test results
log4j:WARN No appenders could be found for logger (org.apache.commons.beanutils.converters.BooleanConverter).
log4j:WARN Please initialize the log4j system properly.
[INFO] 
[INFO] --- maven-jar-plugin:2.4:jar (default-jar) @ 52n-sos-importer-wizard ---
[INFO] Building jar: /var/lib/jenkins/workspace/sos-importer/wizard/target/52n-sos-importer-wizard-0.5.0-SNAPSHOT.jar
[INFO] 
[INFO] --- maven-assembly-plugin:2.3:single (make-assembly) @ 52n-sos-importer-wizard ---
[INFO] Reading assembly descriptor: assembly.xml
[INFO] META-INF/MANIFEST.MF already added, skipping
[INFO] META-INF/MANIFEST.MF already added, skipping
[INFO] META-INF/MANIFEST.MF already added, skipping
[INFO] META-INF/INDEX.LIST already added, skipping
[INFO] META-INF/MANIFEST.MF already added, skipping
[INFO] META-INF/MANIFEST.MF already added, skipping
[INFO] javax/xml/XMLConstants.class already added, skipping
[INFO] javax/xml/namespace/NamespaceContext.class already added, skipping
[INFO] javax/xml/namespace/QName.class already added, skipping
[INFO] org/w3c/dom/DOMConfiguration.class already added, skipping
[INFO] org/w3c/dom/DOMStringList.class already added, skipping
[INFO] org/w3c/dom/TypeInfo.class already added, skipping
[INFO] org/w3c/dom/UserDataHandler.class already added, skipping
[INFO] META-INF/MANIFEST.MF already added, skipping
[INFO] META-INF/MANIFEST.MF already added, skipping
[INFO] copyright.html already added, skipping
[INFO] META-INF/MANIFEST.MF already added, skipping
[INFO] META-INF/MANIFEST.MF already added, skipping
[INFO] copyright.html already added, skipping
[INFO] META-INF/MANIFEST.MF already added, skipping
[INFO] copyright.html already added, skipping
[INFO] META-INF/MANIFEST.MF already added, skipping
[INFO] META-INF/MANIFEST.MF already added, skipping
[INFO] META-INF/MANIFEST.MF already added, skipping
[INFO] META-INF/MANIFEST.MF already added, skipping
[INFO] copyright.html already added, skipping
[INFO] META-INF/MANIFEST.MF already added, skipping
[INFO] copyright.html already added, skipping
[INFO] META-INF/MANIFEST.MF already added, skipping
[INFO] copyright.html already added, skipping
[INFO] META-INF/MANIFEST.MF already added, skipping
[INFO] copyright.html already added, skipping
[INFO] META-INF/MANIFEST.MF already added, skipping
[INFO] copyright.html already added, skipping
[INFO] META-INF/MANIFEST.MF already added, skipping
[INFO] META-INF/INDEX.LIST already added, skipping
[INFO] META-INF/MANIFEST.MF already added, skipping
[INFO] META-INF/MANIFEST.MF already added, skipping
[INFO] META-INF/MANIFEST.MF already added, skipping
[INFO] META-INF/MANIFEST.MF already added, skipping
[INFO] META-INF/LICENSE already added, skipping
[INFO] META-INF/NOTICE already added, skipping
[INFO] META-INF/MANIFEST.MF already added, skipping
[INFO] META-INF/MANIFEST.MF already added, skipping
[INFO] META-INF/NOTICE.txt already added, skipping
[INFO] META-INF/LICENSE.txt already added, skipping
[INFO] META-INF/MANIFEST.MF already added, skipping
[INFO] META-INF/LICENSE.txt already added, skipping
[INFO] META-INF/NOTICE.txt already added, skipping
[INFO] META-INF/MANIFEST.MF already added, skipping
[INFO] META-INF/MANIFEST.MF already added, skipping
[INFO] META-INF/LICENSE.txt already added, skipping
[INFO] META-INF/NOTICE.txt already added, skipping
[INFO] META-INF/MANIFEST.MF already added, skipping
[INFO] META-INF/MANIFEST.MF already added, skipping
[INFO] META-INF/MANIFEST.MF already added, skipping
[INFO] META-INF/MANIFEST.MF already added, skipping
[INFO] META-INF/MANIFEST.MF already added, skipping
[INFO] META-INF/MANIFEST.MF already added, skipping
[INFO] META-INF/LICENSE.txt already added, skipping
[INFO] META-INF/NOTICE.txt already added, skipping
[INFO] META-INF/MANIFEST.MF already added, skipping
[INFO] META-INF/MANIFEST.MF already added, skipping
[INFO] META-INF/MANIFEST.MF already added, skipping
[INFO] META-INF/MANIFEST.MF already added, skipping
[INFO] META-INF/MANIFEST.MF already added, skipping
[INFO] META-INF/MANIFEST.MF already added, skipping
[INFO] 52n_license_header.txt already added, skipping
[INFO] META-INF/MANIFEST.MF already added, skipping
[INFO] META-INF/MANIFEST.MF already added, skipping
[INFO] META-INF/MANIFEST.MF already added, skipping
[INFO] META-INF/INDEX.LIST already added, skipping
[INFO] META-INF/MANIFEST.MF already added, skipping
[INFO] META-INF/MANIFEST.MF already added, skipping
[INFO] javax/xml/XMLConstants.class already added, skipping
[INFO] javax/xml/namespace/NamespaceContext.class already added, skipping
[INFO] javax/xml/namespace/QName.class already added, skipping
[INFO] org/w3c/dom/DOMConfiguration.class already added, skipping
[INFO] org/w3c/dom/DOMStringList.class already added, skipping
[INFO] org/w3c/dom/TypeInfo.class already added, skipping
[INFO] org/w3c/dom/UserDataHandler.class already added, skipping
[INFO] META-INF/MANIFEST.MF already added, skipping
[INFO] META-INF/MANIFEST.MF already added, skipping
[INFO] copyright.html already added, skipping
[INFO] META-INF/MANIFEST.MF already added, skipping
[INFO] META-INF/MANIFEST.MF already added, skipping
[INFO] copyright.html already added, skipping
[INFO] META-INF/MANIFEST.MF already added, skipping
[INFO] copyright.html already added, skipping
[INFO] META-INF/MANIFEST.MF already added, skipping
[INFO] META-INF/MANIFEST.MF already added, skipping
[INFO] META-INF/MANIFEST.MF already added, skipping
[INFO] META-INF/MANIFEST.MF already added, skipping
[INFO] copyright.html already added, skipping
[INFO] META-INF/MANIFEST.MF already added, skipping
[INFO] copyright.html already added, skipping
[INFO] META-INF/MANIFEST.MF already added, skipping
[INFO] copyright.html already added, skipping
[INFO] META-INF/MANIFEST.MF already added, skipping
[INFO] copyright.html already added, skipping
[INFO] META-INF/MANIFEST.MF already added, skipping
[INFO] copyright.html already added, skipping
[INFO] META-INF/MANIFEST.MF already added, skipping
[INFO] META-INF/INDEX.LIST already added, skipping
[INFO] META-INF/MANIFEST.MF already added, skipping
[INFO] META-INF/MANIFEST.MF already added, skipping
[INFO] META-INF/MANIFEST.MF already added, skipping
[INFO] META-INF/MANIFEST.MF already added, skipping
[INFO] META-INF/LICENSE already added, skipping
[INFO] META-INF/NOTICE already added, skipping
[INFO] META-INF/MANIFEST.MF already added, skipping
[INFO] META-INF/MANIFEST.MF already added, skipping
[INFO] META-INF/NOTICE.txt already added, skipping
[INFO] META-INF/LICENSE.txt already added, skipping
[INFO] META-INF/MANIFEST.MF already added, skipping
[INFO] META-INF/LICENSE.txt already added, skipping
[INFO] META-INF/NOTICE.txt already added, skipping
[INFO] META-INF/MANIFEST.MF already added, skipping
[INFO] META-INF/MANIFEST.MF already added, skipping
[INFO] META-INF/LICENSE.txt already added, skipping
[INFO] META-INF/NOTICE.txt already added, skipping
[INFO] META-INF/MANIFEST.MF already added, skipping
[INFO] META-INF/MANIFEST.MF already added, skipping
[INFO] META-INF/MANIFEST.MF already added, skipping
[INFO] META-INF/MANIFEST.MF already added, skipping
[INFO] META-INF/MANIFEST.MF already added, skipping
[INFO] META-INF/MANIFEST.MF already added, skipping
[INFO] META-INF/LICENSE.txt already added, skipping
[INFO] META-INF/NOTICE.txt already added, skipping
[INFO] META-INF/MANIFEST.MF already added, skipping
[INFO] META-INF/MANIFEST.MF already added, skipping
[INFO] META-INF/MANIFEST.MF already added, skipping
[INFO] META-INF/MANIFEST.MF already added, skipping
[INFO] META-INF/MANIFEST.MF already added, skipping
[INFO] META-INF/MANIFEST.MF already added, skipping
[INFO] 52n_license_header.txt already added, skipping
[INFO] Building jar: /var/lib/jenkins/workspace/sos-importer/wizard/target/52n-sos-importer-wizard-bin.jar
[INFO] META-INF/MANIFEST.MF already added, skipping
[INFO] META-INF/MANIFEST.MF already added, skipping
[INFO] META-INF/MANIFEST.MF already added, skipping
[INFO] META-INF/INDEX.LIST already added, skipping
[INFO] META-INF/MANIFEST.MF already added, skipping
[INFO] META-INF/MANIFEST.MF already added, skipping
[INFO] javax/xml/XMLConstants.class already added, skipping
[INFO] javax/xml/namespace/NamespaceContext.class already added, skipping
[INFO] javax/xml/namespace/QName.class already added, skipping
[INFO] org/w3c/dom/DOMConfiguration.class already added, skipping
[INFO] org/w3c/dom/DOMStringList.class already added, skipping
[INFO] org/w3c/dom/TypeInfo.class already added, skipping
[INFO] org/w3c/dom/UserDataHandler.class already added, skipping
[INFO] META-INF/MANIFEST.MF already added, skipping
[INFO] META-INF/MANIFEST.MF already added, skipping
[INFO] copyright.html already added, skipping
[INFO] META-INF/MANIFEST.MF already added, skipping
[INFO] META-INF/MANIFEST.MF already added, skipping
[INFO] copyright.html already added, skipping
[INFO] META-INF/MANIFEST.MF already added, skipping
[INFO] copyright.html already added, skipping
[INFO] META-INF/MANIFEST.MF already added, skipping
[INFO] META-INF/MANIFEST.MF already added, skipping
[INFO] META-INF/MANIFEST.MF already added, skipping
[INFO] META-INF/MANIFEST.MF already added, skipping
[INFO] copyright.html already added, skipping
[INFO] META-INF/MANIFEST.MF already added, skipping
[INFO] copyright.html already added, skipping
[INFO] META-INF/MANIFEST.MF already added, skipping
[INFO] copyright.html already added, skipping
[INFO] META-INF/MANIFEST.MF already added, skipping
[INFO] copyright.html already added, skipping
[INFO] META-INF/MANIFEST.MF already added, skipping
[INFO] copyright.html already added, skipping
[INFO] META-INF/MANIFEST.MF already added, skipping
[INFO] META-INF/INDEX.LIST already added, skipping
[INFO] META-INF/MANIFEST.MF already added, skipping
[INFO] META-INF/MANIFEST.MF already added, skipping
[INFO] META-INF/MANIFEST.MF already added, skipping
[INFO] META-INF/MANIFEST.MF already added, skipping
[INFO] META-INF/LICENSE already added, skipping
[INFO] META-INF/NOTICE already added, skipping
[INFO] META-INF/MANIFEST.MF already added, skipping
[INFO] META-INF/MANIFEST.MF already added, skipping
[INFO] META-INF/NOTICE.txt already added, skipping
[INFO] META-INF/LICENSE.txt already added, skipping
[INFO] META-INF/MANIFEST.MF already added, skipping
[INFO] META-INF/LICENSE.txt already added, skipping
[INFO] META-INF/NOTICE.txt already added, skipping
[INFO] META-INF/MANIFEST.MF already added, skipping
[INFO] META-INF/MANIFEST.MF already added, skipping
[INFO] META-INF/LICENSE.txt already added, skipping
[INFO] META-INF/NOTICE.txt already added, skipping
[INFO] META-INF/MANIFEST.MF already added, skipping
[INFO] META-INF/MANIFEST.MF already added, skipping
[INFO] META-INF/MANIFEST.MF already added, skipping
[INFO] META-INF/MANIFEST.MF already added, skipping
[INFO] META-INF/MANIFEST.MF already added, skipping
[INFO] META-INF/MANIFEST.MF already added, skipping
[INFO] META-INF/LICENSE.txt already added, skipping
[INFO] META-INF/NOTICE.txt already added, skipping
[INFO] META-INF/MANIFEST.MF already added, skipping
[INFO] META-INF/MANIFEST.MF already added, skipping
[INFO] META-INF/MANIFEST.MF already added, skipping
[INFO] META-INF/MANIFEST.MF already added, skipping
[INFO] META-INF/MANIFEST.MF already added, skipping
[INFO] META-INF/MANIFEST.MF already added, skipping
[INFO] 52n_license_header.txt already added, skipping
[INFO] 
[INFO] --- maven-install-plugin:2.4:install (default-install) @ 52n-sos-importer-wizard ---
[INFO] Installing /var/lib/jenkins/workspace/sos-importer/wizard/target/52n-sos-importer-wizard-0.5.0-SNAPSHOT.jar to /var/lib/jenkins/.m2/repository/org/n52/sensorweb/52n-sos-importer-wizard/0.5.0-SNAPSHOT/52n-sos-importer-wizard-0.5.0-SNAPSHOT.jar
[INFO] Installing /var/lib/jenkins/workspace/sos-importer/wizard/pom.xml to /var/lib/jenkins/.m2/repository/org/n52/sensorweb/52n-sos-importer-wizard/0.5.0-SNAPSHOT/52n-sos-importer-wizard-0.5.0-SNAPSHOT.pom
[INFO] Installing /var/lib/jenkins/workspace/sos-importer/wizard/target/52n-sos-importer-wizard-bin.jar to /var/lib/jenkins/.m2/repository/org/n52/sensorweb/52n-sos-importer-wizard/0.5.0-SNAPSHOT/52n-sos-importer-wizard-0.5.0-SNAPSHOT-bin.jar
[INFO]                                                                         
[INFO] ------------------------------------------------------------------------
[INFO] Building Feeding Module 0.5.0-SNAPSHOT
[INFO] ------------------------------------------------------------------------
[INFO] 
[INFO] --- maven-clean-plugin:2.5:clean (default-clean) @ 52n-sos-importer-feeder ---
[INFO] Deleting /var/lib/jenkins/workspace/sos-importer/feeder/target
[INFO] 
[INFO] --- license-maven-plugin:2.6:check (check-license) @ 52n-sos-importer-feeder ---
[INFO] Checking licenses...
[INFO] 
[INFO] --- maven-resources-plugin:2.6:resources (default-resources) @ 52n-sos-importer-feeder ---
[INFO] Using 'UTF-8' encoding to copy filtered resources.
[INFO] Copying 4 resources
[INFO] 
[INFO] --- maven-compiler-plugin:2.5.1:compile (default-compile) @ 52n-sos-importer-feeder ---
[INFO] Compiling 25 source files to /var/lib/jenkins/workspace/sos-importer/feeder/target/classes
[INFO] -------------------------------------------------------------
[ERROR] COMPILATION ERROR : 
[INFO] -------------------------------------------------------------
[ERROR] bad path element "/var/lib/jenkins/.m2/repository/org/n52/sensorweb/oxf-feature/2.0.0-SNAPSHOT/stax-api-1.0.1.jar": no such file or directory
/var/lib/jenkins/workspace/sos-importer/feeder/src/main/java/org/n52/sos/importer/feeder/model/TimeSeries.java:[194,67] error: cannot find symbol
[ERROR]   symbol:   variable QN_SWE_2_0_TEXT
  location: class XMLConstants
/var/lib/jenkins/workspace/sos-importer/feeder/src/main/java/org/n52/sos/importer/feeder/model/TimeSeries.java:[199,67] error: cannot find symbol
[ERROR]   symbol:   variable QN_SWE_2_0_COUNT
  location: class XMLConstants
/var/lib/jenkins/workspace/sos-importer/feeder/src/main/java/org/n52/sos/importer/feeder/model/TimeSeries.java:[204,67] error: cannot find symbol
[INFO] 3 errors 
[INFO] -------------------------------------------------------------
[INFO] ------------------------------------------------------------------------
[INFO] Reactor Summary:
[INFO] 
[INFO] 52North SOS-Importer .............................. SUCCESS [  0.461 s]
[INFO] XMLbeans Module ................................... SUCCESS [  5.048 s]
[INFO] Wizard Module ..................................... SUCCESS [ 15.667 s]
[INFO] Feeding Module .................................... FAILURE [  1.300 s]
[INFO] ------------------------------------------------------------------------
[INFO] BUILD FAILURE
[INFO] ------------------------------------------------------------------------
[INFO] Total time: 24.073 s
[INFO] Finished at: 2015-05-18T15:18:19+01:00
[INFO] Final Memory: 38M/244M
[INFO] ------------------------------------------------------------------------
[ERROR] Failed to execute goal org.apache.maven.plugins:maven-compiler-plugin:2.5.1:compile (default-compile) on project 52n-sos-importer-feeder: Compilation failure: Compilation failure:
[ERROR] bad path element "/var/lib/jenkins/.m2/repository/org/n52/sensorweb/oxf-feature/2.0.0-SNAPSHOT/stax-api-1.0.1.jar": no such file or directory
[ERROR] /var/lib/jenkins/workspace/sos-importer/feeder/src/main/java/org/n52/sos/importer/feeder/model/TimeSeries.java:[194,67] error: cannot find symbol
[ERROR] symbol:   variable QN_SWE_2_0_TEXT
[ERROR] location: class XMLConstants
[ERROR] /var/lib/jenkins/workspace/sos-importer/feeder/src/main/java/org/n52/sos/importer/feeder/model/TimeSeries.java:[199,67] error: cannot find symbol
[ERROR] symbol:   variable QN_SWE_2_0_COUNT
[ERROR] location: class XMLConstants
[ERROR] /var/lib/jenkins/workspace/sos-importer/feeder/src/main/java/org/n52/sos/importer/feeder/model/TimeSeries.java:[204,67] error: cannot find symbol
[ERROR] -> [Help 1]
[ERROR] 
[ERROR] To see the full stack trace of the errors, re-run Maven with the -e switch.
[ERROR] Re-run Maven using the -X switch to enable full debug logging.
[ERROR] 
[ERROR] For more information about the errors and possible solutions, please read the following articles:
[ERROR] [Help 1] http://cwiki.apache.org/confluence/display/MAVEN/MojoFailureException
[ERROR] 
[ERROR] After correcting the problems, you can resume the build with the command
[ERROR]   mvn <goals> -rf :52n-sos-importer-feeder
[JENKINS] Archiving /var/lib/jenkins/workspace/sos-importer/bindings/pom.xml to org.n52.sensorweb/52n-sos-importer-bindings/0.5.0-SNAPSHOT/52n-sos-importer-bindings-0.5.0-SNAPSHOT.pom
[JENKINS] Archiving /var/lib/jenkins/workspace/sos-importer/bindings/target/52n-sos-importer-bindings-0.5.0-SNAPSHOT.jar to org.n52.sensorweb/52n-sos-importer-bindings/0.5.0-SNAPSHOT/52n-sos-importer-bindings-0.5.0-SNAPSHOT.jar
[JENKINS] Archiving /var/lib/jenkins/workspace/sos-importer/pom.xml to org.n52.sensorweb/52n-sos-importer/0.5.0-SNAPSHOT/52n-sos-importer-0.5.0-SNAPSHOT.pom
[JENKINS] Archiving /var/lib/jenkins/workspace/sos-importer/wizard/pom.xml to org.n52.sensorweb/52n-sos-importer-wizard/0.5.0-SNAPSHOT/52n-sos-importer-wizard-0.5.0-SNAPSHOT.pom
[JENKINS] Archiving /var/lib/jenkins/workspace/sos-importer/wizard/target/52n-sos-importer-wizard-0.5.0-SNAPSHOT.jar to org.n52.sensorweb/52n-sos-importer-wizard/0.5.0-SNAPSHOT/52n-sos-importer-wizard-0.5.0-SNAPSHOT.jar
[JENKINS] Archiving /var/lib/jenkins/workspace/sos-importer/wizard/target/52n-sos-importer-wizard-bin.jar to org.n52.sensorweb/52n-sos-importer-wizard/0.5.0-SNAPSHOT/52n-sos-importer-wizard-0.5.0-SNAPSHOT-bin.jar
[JENKINS] Archiving /var/lib/jenkins/workspace/sos-importer/feeder/pom.xml to org.n52.sensorweb/52n-sos-importer-feeder/0.5.0-SNAPSHOT/52n-sos-importer-feeder-0.5.0-SNAPSHOT.pom
channel stopped
Skipping sonar analysis due to bad build status FAILURE
Sending e-mails to: sensorweb-commits@52north.org
Finished: FAILURE