Console Output

Started by user BenjaminPross
Building in workspace /var/lib/jenkins/workspace/wps-client-lib RELEASE
 > git rev-parse --is-inside-work-tree # timeout=10
Fetching changes from the remote Git repository
 > git config remote.origin.url https://github.com/52North/wps-client-lib.git # timeout=10
Fetching upstream changes from https://github.com/52North/wps-client-lib.git
 > git --version # timeout=10
using GIT_SSH to set credentials 52n Jenkins CI user on GitHub
 > git fetch --tags --progress https://github.com/52North/wps-client-lib.git +refs/heads/*:refs/remotes/origin/*
 > git rev-parse origin/master^{commit} # timeout=10
Checking out Revision 4e0a4bff2105ba5a8efc889675cd849c24b5131d (origin/master)
 > git config core.sparsecheckout # timeout=10
 > git checkout -f 4e0a4bff2105ba5a8efc889675cd849c24b5131d
 > git branch -a -v --no-abbrev # timeout=10
 > git branch -D master # timeout=10
 > git checkout -b master 4e0a4bff2105ba5a8efc889675cd849c24b5131d
Commit message: "Merge pull request #3 from bpross-52n/master"
 > git rev-list --no-walk 4e0a4bff2105ba5a8efc889675cd849c24b5131d # timeout=10
Parsing POMs
Established TCP socket on 40476
[wps-client-lib RELEASE] $ /var/lib/jenkins/tools/hudson.model.JDK/Java-1.8_161/bin/java -Xmx1024m -XX:MaxPermSize=1024m -cp /var/lib/jenkins/plugins/maven-plugin/WEB-INF/lib/maven35-agent-1.12-alpha-1.jar:/var/lib/jenkins/tools/hudson.tasks.Maven_MavenInstallation/Maven353/boot/plexus-classworlds-2.5.2.jar:/var/lib/jenkins/tools/hudson.tasks.Maven_MavenInstallation/Maven353/conf/logging jenkins.maven3.agent.Maven35Main /var/lib/jenkins/tools/hudson.tasks.Maven_MavenInstallation/Maven353 /var/cache/jenkins/war/WEB-INF/lib/remoting-3.26.jar /var/lib/jenkins/plugins/maven-plugin/WEB-INF/lib/maven35-interceptor-1.12-alpha-1.jar /var/lib/jenkins/plugins/maven-plugin/WEB-INF/lib/maven3-interceptor-commons-1.12-alpha-1.jar 40476
Java HotSpot(TM) 64-Bit Server VM warning: ignoring option MaxPermSize=1024m; support was removed in 8.0
<===[JENKINS REMOTING CAPACITY]===>channel started
Executing Maven:  -B -f /var/lib/jenkins/workspace/wps-client-lib RELEASE/pom.xml -DdevelopmentVersion=1.0.1-SNAPSHOT -DreleaseVersion=1.0.0 -Dtag=v1.0.0 -Dresume=false release:prepare release:perform
[INFO] Scanning for projects...
[INFO] 
[INFO] ----------------< org.n52.geoprocessing:wps-client-lib >----------------
[INFO] Building 52 North WPS Client libary 1.0.0-SNAPSHOT
[INFO] --------------------------------[ jar ]---------------------------------
[INFO] 
[INFO] --- maven-release-plugin:2.5.3:prepare (default-cli) @ wps-client-lib ---
[INFO] Verifying that there are no local modifications...
[INFO]   ignoring changes on: **/pom.xml.releaseBackup, **/pom.xml.next, **/pom.xml.tag, **/pom.xml.branch, **/release.properties, **/pom.xml.backup
[INFO] Executing: /bin/sh -c cd "/var/lib/jenkins/workspace/wps-client-lib RELEASE" && git rev-parse --show-toplevel
[INFO] Working directory: /var/lib/jenkins/workspace/wps-client-lib RELEASE
[INFO] Executing: /bin/sh -c cd "/var/lib/jenkins/workspace/wps-client-lib RELEASE" && git status --porcelain .
[INFO] Working directory: /var/lib/jenkins/workspace/wps-client-lib RELEASE
[WARNING] Ignoring unrecognized line: ?? pom.xml.releaseBackup
[WARNING] Ignoring unrecognized line: ?? release.properties
[WARNING] Ignoring unrecognized line: ?? wps-client.log
[INFO] Checking dependencies and plugins for snapshots ...
[INFO] Transforming '52 North WPS Client libary'...
[INFO] Not generating release POMs
[INFO] Executing goals 'clean install'...
[INFO] Java HotSpot(TM) 64-Bit Server VM warning: ignoring option MaxPermSize=1024m; support was removed in 8.0
[INFO] [INFO] Scanning for projects...
[INFO] [INFO] 
[INFO] [INFO] ----------------< org.n52.geoprocessing:wps-client-lib >----------------
[INFO] [INFO] Building 52 North WPS Client libary 1.0.0
[INFO] [INFO] --------------------------------[ jar ]---------------------------------
[INFO] [INFO] 
[INFO] [INFO] --- maven-clean-plugin:3.0.0:clean (default-clean) @ wps-client-lib ---
[INFO] [INFO] Deleting /mnt/extra/jenkins/workspace/wps-client-lib RELEASE/target
[INFO] [INFO] 
[INFO] [INFO] --- git-commit-id-plugin:2.2.4:revision (default) @ wps-client-lib ---
[INFO] [INFO] 
[INFO] [INFO] --- maven-enforcer-plugin:1.4.1:enforce (default) @ wps-client-lib ---
[INFO] [INFO] 
[INFO] [INFO] --- maven-notice-plugin:1.1.0:generate (generate-notice) @ wps-client-lib ---
[INFO] [INFO] Loading license lookup mappings from 'http://52north.github.io/cdn/licenses/license-mappings.xml'
[INFO] [INFO] Parsing Dependencies for: 52 North WPS Client libary
[INFO] [INFO] 
[INFO] [INFO] --- whitespace-maven-plugin:1.0.4:trim (default) @ wps-client-lib ---
[INFO] [INFO] 
[INFO] [INFO] --- maven-resources-plugin:3.0.2:resources (default-resources) @ wps-client-lib ---
[INFO] [INFO] Using 'UTF-8' encoding to copy filtered resources.
[INFO] [INFO] Copying 2 resources
[INFO] [INFO] 
[INFO] [INFO] --- license-maven-plugin:3.0:format (format-license-headers) @ wps-client-lib ---
[INFO] [INFO] Updating license headers...
[INFO] [INFO] Updating license header in: /mnt/extra/jenkins/workspace/wps-client-lib RELEASE/pom.xml
[INFO] [INFO] 
[INFO] [INFO] --- maven-compiler-plugin:3.7.0:compile (default-compile) @ wps-client-lib ---
[INFO] [INFO] Changes detected - recompiling the module!
[INFO] [INFO] Compiling 65 source files to /mnt/extra/jenkins/workspace/wps-client-lib RELEASE/target/classes
[INFO] [INFO] 
[INFO] [INFO] --- maven-resources-plugin:3.0.2:testResources (default-testResources) @ wps-client-lib ---
[INFO] [INFO] Using 'UTF-8' encoding to copy filtered resources.
[INFO] [INFO] Copying 19 resources
[INFO] [INFO] 
[INFO] [INFO] --- maven-compiler-plugin:3.7.0:testCompile (default-testCompile) @ wps-client-lib ---
[INFO] [INFO] Changes detected - recompiling the module!
[INFO] [INFO] Compiling 6 source files to /mnt/extra/jenkins/workspace/wps-client-lib RELEASE/target/test-classes
[INFO] [INFO] 
[INFO] [INFO] --- maven-surefire-plugin:2.21.0:test (default-test) @ wps-client-lib ---
[INFO] [INFO] 
[INFO] [INFO] -------------------------------------------------------
[INFO] [INFO]  T E S T S
[INFO] [INFO] -------------------------------------------------------
[INFO] [INFO] Running org.n52.geoprocessing.wps.client.WPSResponseReaderTest
[INFO] 2018-11-26 09:56:49,462 [main] INFO  org.n52.geoprocessing.wps.client.decoder.stream.GetStatusResponse100Decoder: Status location attribute not present.
[INFO] 2018-11-26 09:56:49,473 [main] INFO  org.n52.geoprocessing.wps.client.decoder.stream.GetStatusResponse100Decoder: Status location attribute not present.
[INFO] 2018-11-26 09:56:49,488 [main] INFO  org.n52.geoprocessing.wps.client.decoder.stream.GetStatusResponse100Decoder: Status location attribute not present.
[INFO] 2018-11-26 09:56:49,540 [main] INFO  org.n52.geoprocessing.wps.client.decoder.stream.GetStatusResponse100Decoder: Status location attribute not present.
[INFO] [INFO] Tests run: 16, Failures: 0, Errors: 0, Skipped: 0, Time elapsed: 0.362 s - in org.n52.geoprocessing.wps.client.WPSResponseReaderTest
[INFO] [INFO] Running org.n52.geoprocessing.wps.client.WPS20ProcessParserTest
[INFO] 2018-11-26 09:56:49,562 [main] INFO  org.n52.geoprocessing.wps.client.WPS20ProcessParserTest: data
[INFO] [INFO] Tests run: 1, Failures: 0, Errors: 0, Skipped: 0, Time elapsed: 0.008 s - in org.n52.geoprocessing.wps.client.WPS20ProcessParserTest
[INFO] [INFO] Running org.n52.geoprocessing.wps.client.ExecuteEncoderTest
[INFO] [INFO] Tests run: 5, Failures: 0, Errors: 0, Skipped: 0, Time elapsed: 0.209 s - in org.n52.geoprocessing.wps.client.ExecuteEncoderTest
[INFO] [INFO] Running org.n52.geoprocessing.wps.client.ExecuteRequestBuilderTest
[INFO] [INFO] Tests run: 1, Failures: 0, Errors: 0, Skipped: 0, Time elapsed: 0.001 s - in org.n52.geoprocessing.wps.client.ExecuteRequestBuilderTest
[INFO] [INFO] 
[INFO] [INFO] Results:
[INFO] [INFO] 
[INFO] [INFO] Tests run: 23, Failures: 0, Errors: 0, Skipped: 0
[INFO] [INFO] 
[INFO] [INFO] 
[INFO] [INFO] --- maven-jar-plugin:3.0.2:jar (default-jar) @ wps-client-lib ---
[INFO] [INFO] Building jar: /mnt/extra/jenkins/workspace/wps-client-lib RELEASE/target/wps-client-lib-1.0.0.jar
[INFO] [INFO] 
[INFO] [INFO] >>> maven-source-plugin:3.0.1:jar (default) > generate-sources @ wps-client-lib >>>
[INFO] [INFO] 
[INFO] [INFO] --- git-commit-id-plugin:2.2.4:revision (default) @ wps-client-lib ---
[INFO] [INFO] 
[INFO] [INFO] --- maven-enforcer-plugin:1.4.1:enforce (default) @ wps-client-lib ---
[INFO] [INFO] 
[INFO] [INFO] --- maven-notice-plugin:1.1.0:generate (generate-notice) @ wps-client-lib ---
[INFO] [INFO] Loading license lookup mappings from 'http://52north.github.io/cdn/licenses/license-mappings.xml' (cached)
[INFO] [INFO] Parsing Dependencies for: 52 North WPS Client libary
[INFO] [INFO] 
[INFO] [INFO] <<< maven-source-plugin:3.0.1:jar (default) < generate-sources @ wps-client-lib <<<
[INFO] [INFO] 
[INFO] [INFO] 
[INFO] [INFO] --- maven-source-plugin:3.0.1:jar (default) @ wps-client-lib ---
[INFO] [INFO] Building jar: /mnt/extra/jenkins/workspace/wps-client-lib RELEASE/target/wps-client-lib-1.0.0-sources.jar
[INFO] [INFO] 
[INFO] [INFO] --- maven-javadoc-plugin:3.0.0:jar (default) @ wps-client-lib ---
[INFO] [INFO] Building jar: /mnt/extra/jenkins/workspace/wps-client-lib RELEASE/target/wps-client-lib-1.0.0-javadoc.jar
[INFO] [INFO] 
[INFO] [INFO] --- maven-dependency-plugin:3.1.0:analyze-only (analyze-dependencies) @ wps-client-lib ---
[INFO] [INFO] No dependency problems found
[INFO] [INFO] 
[INFO] [INFO] --- maven-install-plugin:2.5.2:install (default-install) @ wps-client-lib ---
[INFO] [INFO] Installing /mnt/extra/jenkins/workspace/wps-client-lib RELEASE/target/wps-client-lib-1.0.0.jar to /mnt/extra/maven-repository/org/n52/geoprocessing/wps-client-lib/1.0.0/wps-client-lib-1.0.0.jar
[INFO] [INFO] Installing /mnt/extra/jenkins/workspace/wps-client-lib RELEASE/pom.xml to /mnt/extra/maven-repository/org/n52/geoprocessing/wps-client-lib/1.0.0/wps-client-lib-1.0.0.pom
[INFO] [INFO] Installing /mnt/extra/jenkins/workspace/wps-client-lib RELEASE/target/wps-client-lib-1.0.0-sources.jar to /mnt/extra/maven-repository/org/n52/geoprocessing/wps-client-lib/1.0.0/wps-client-lib-1.0.0-sources.jar
[INFO] [INFO] Installing /mnt/extra/jenkins/workspace/wps-client-lib RELEASE/target/wps-client-lib-1.0.0-javadoc.jar to /mnt/extra/maven-repository/org/n52/geoprocessing/wps-client-lib/1.0.0/wps-client-lib-1.0.0-javadoc.jar
[INFO] [INFO] 
[INFO] [INFO] --- maven-dependency-plugin:3.1.0:resolve (download-sources) @ wps-client-lib ---
[INFO] [INFO] 
[INFO] [INFO] --- maven-dependency-plugin:3.1.0:resolve (download-javadoc) @ wps-client-lib ---
[INFO] [INFO] 
[INFO] [INFO] --- maven-assembly-plugin:3.1.0:single (default) @ wps-client-lib ---
[INFO] [INFO] Reading assembly descriptor: src/main/config/assemble.xml
[INFO] [INFO] Copying files to /mnt/extra/jenkins/workspace/wps-client-lib RELEASE/target/wps-client-lib-1.0.0-binaries
[INFO] [WARNING] Assembly file: /mnt/extra/jenkins/workspace/wps-client-lib RELEASE/target/wps-client-lib-1.0.0-binaries is not a regular file (it may be a directory). It cannot be attached to the project build for installation or deployment.
[INFO] [INFO] Building zip: /mnt/extra/jenkins/workspace/wps-client-lib RELEASE/target/wps-client-lib-1.0.0-binaries.zip
[INFO] [INFO] Building tar: /mnt/extra/jenkins/workspace/wps-client-lib RELEASE/target/wps-client-lib-1.0.0-binaries.tar.gz
[INFO] [INFO] ------------------------------------------------------------------------
[INFO] [INFO] BUILD SUCCESS
[INFO] [INFO] ------------------------------------------------------------------------
[INFO] [INFO] Total time: 9.776 s
[INFO] [INFO] Finished at: 2018-11-26T09:56:54Z
[INFO] [INFO] ------------------------------------------------------------------------
[INFO] Checking in modified POMs...
[INFO] Executing: /bin/sh -c cd "/var/lib/jenkins/workspace/wps-client-lib RELEASE" && git add -- pom.xml
[INFO] Working directory: /var/lib/jenkins/workspace/wps-client-lib RELEASE
[INFO] Executing: /bin/sh -c cd "/var/lib/jenkins/workspace/wps-client-lib RELEASE" && git rev-parse --show-toplevel
[INFO] Working directory: /var/lib/jenkins/workspace/wps-client-lib RELEASE
[INFO] Executing: /bin/sh -c cd "/var/lib/jenkins/workspace/wps-client-lib RELEASE" && git status --porcelain .
[INFO] Working directory: /var/lib/jenkins/workspace/wps-client-lib RELEASE
[WARNING] Ignoring unrecognized line: ?? pom.xml.releaseBackup
[WARNING] Ignoring unrecognized line: ?? release.properties
[WARNING] Ignoring unrecognized line: ?? wps-client.log
[INFO] Executing: /bin/sh -c cd "/var/lib/jenkins/workspace/wps-client-lib RELEASE" && git commit --verbose -F /tmp/maven-scm-1759573486.commit pom.xml
[INFO] Working directory: /var/lib/jenkins/workspace/wps-client-lib RELEASE
[INFO] Executing: /bin/sh -c cd "/var/lib/jenkins/workspace/wps-client-lib RELEASE" && git symbolic-ref HEAD
[INFO] Working directory: /var/lib/jenkins/workspace/wps-client-lib RELEASE
[INFO] Executing: /bin/sh -c cd "/var/lib/jenkins/workspace/wps-client-lib RELEASE" && git push ssh:********@github.com/52North/wps-client-lib.git refs/heads/master:refs/heads/master
[INFO] Working directory: /var/lib/jenkins/workspace/wps-client-lib RELEASE
[INFO] Tagging release with the label v1.0.0...
[INFO] Executing: /bin/sh -c cd "/mnt/extra/jenkins/workspace/wps-client-lib RELEASE" && git tag -F /tmp/maven-scm-1691630706.commit v1.0.0
[INFO] Working directory: /mnt/extra/jenkins/workspace/wps-client-lib RELEASE
[INFO] Executing: /bin/sh -c cd "/mnt/extra/jenkins/workspace/wps-client-lib RELEASE" && git push ssh:********@github.com/52North/wps-client-lib.git refs/tags/v1.0.0
[INFO] Working directory: /mnt/extra/jenkins/workspace/wps-client-lib RELEASE
[INFO] Executing: /bin/sh -c cd "/mnt/extra/jenkins/workspace/wps-client-lib RELEASE" && git ls-files
[INFO] Working directory: /mnt/extra/jenkins/workspace/wps-client-lib RELEASE
[INFO] Transforming '52 North WPS Client libary'...
[INFO] Not removing release POMs
[INFO] Checking in modified POMs...
[INFO] Executing: /bin/sh -c cd "/var/lib/jenkins/workspace/wps-client-lib RELEASE" && git add -- pom.xml
[INFO] Working directory: /var/lib/jenkins/workspace/wps-client-lib RELEASE
[INFO] Executing: /bin/sh -c cd "/var/lib/jenkins/workspace/wps-client-lib RELEASE" && git rev-parse --show-toplevel
[INFO] Working directory: /var/lib/jenkins/workspace/wps-client-lib RELEASE
[INFO] Executing: /bin/sh -c cd "/var/lib/jenkins/workspace/wps-client-lib RELEASE" && git status --porcelain .
[INFO] Working directory: /var/lib/jenkins/workspace/wps-client-lib RELEASE
[WARNING] Ignoring unrecognized line: ?? pom.xml.releaseBackup
[WARNING] Ignoring unrecognized line: ?? release.properties
[WARNING] Ignoring unrecognized line: ?? wps-client.log
[INFO] Executing: /bin/sh -c cd "/var/lib/jenkins/workspace/wps-client-lib RELEASE" && git commit --verbose -F /tmp/maven-scm-2118066056.commit pom.xml
[INFO] Working directory: /var/lib/jenkins/workspace/wps-client-lib RELEASE
[INFO] Executing: /bin/sh -c cd "/var/lib/jenkins/workspace/wps-client-lib RELEASE" && git symbolic-ref HEAD
[INFO] Working directory: /var/lib/jenkins/workspace/wps-client-lib RELEASE
[INFO] Executing: /bin/sh -c cd "/var/lib/jenkins/workspace/wps-client-lib RELEASE" && git push ssh:********@github.com/52North/wps-client-lib.git refs/heads/master:refs/heads/master
[INFO] Working directory: /var/lib/jenkins/workspace/wps-client-lib RELEASE
[INFO] Release preparation complete.
[INFO] 
[INFO] --- maven-release-plugin:2.5.3:perform (default-cli) @ wps-client-lib ---
[INFO] Performing a LOCAL checkout from scm:git:file:///var/lib/jenkins/workspace/wps-client-lib RELEASE
[INFO] Checking out the project to perform the release ...
[INFO] Executing: /bin/sh -c cd "/var/lib/jenkins/workspace/wps-client-lib RELEASE/target" && git clone --branch v1.0.0 'file:///var/lib/jenkins/workspace/wps-client-lib RELEASE' '/var/lib/jenkins/workspace/wps-client-lib RELEASE/target/checkout'
[INFO] Working directory: /var/lib/jenkins/workspace/wps-client-lib RELEASE/target
[INFO] Executing: /bin/sh -c cd /tmp && git ls-remote 'file:///var/lib/jenkins/workspace/wps-client-lib RELEASE'
[INFO] Working directory: /tmp
[INFO] Executing: /bin/sh -c cd "/var/lib/jenkins/workspace/wps-client-lib RELEASE/target/checkout" && git fetch 'file:///var/lib/jenkins/workspace/wps-client-lib RELEASE'
[INFO] Working directory: /var/lib/jenkins/workspace/wps-client-lib RELEASE/target/checkout
[INFO] Executing: /bin/sh -c cd "/var/lib/jenkins/workspace/wps-client-lib RELEASE/target/checkout" && git checkout v1.0.0
[INFO] Working directory: /var/lib/jenkins/workspace/wps-client-lib RELEASE/target/checkout
[INFO] Executing: /bin/sh -c cd "/var/lib/jenkins/workspace/wps-client-lib RELEASE/target/checkout" && git ls-files
[INFO] Working directory: /var/lib/jenkins/workspace/wps-client-lib RELEASE/target/checkout
[INFO] Invoking perform goals in directory /var/lib/jenkins/workspace/wps-client-lib RELEASE/target/checkout
[INFO] Executing goals 'deploy'...
[INFO] Java HotSpot(TM) 64-Bit Server VM warning: ignoring option MaxPermSize=1024m; support was removed in 8.0
[INFO] [INFO] Scanning for projects...
[INFO] [INFO] 
[INFO] [INFO] ----------------< org.n52.geoprocessing:wps-client-lib >----------------
[INFO] [INFO] Building 52 North WPS Client libary 1.0.0
[INFO] [INFO] --------------------------------[ jar ]---------------------------------
[INFO] [INFO] 
[INFO] [INFO] --- git-commit-id-plugin:2.2.4:revision (default) @ wps-client-lib ---
[INFO] [INFO] 
[INFO] [INFO] --- maven-enforcer-plugin:1.4.1:enforce (default) @ wps-client-lib ---
[INFO] [INFO] 
[INFO] [INFO] --- maven-notice-plugin:1.1.0:generate (generate-notice) @ wps-client-lib ---
[INFO] [INFO] Loading license lookup mappings from 'http://52north.github.io/cdn/licenses/license-mappings.xml'
[INFO] [INFO] Parsing Dependencies for: 52 North WPS Client libary
[INFO] [INFO] 
[INFO] [INFO] --- whitespace-maven-plugin:1.0.4:trim (default) @ wps-client-lib ---
[INFO] [INFO] 
[INFO] [INFO] --- maven-resources-plugin:3.0.2:resources (default-resources) @ wps-client-lib ---
[INFO] [INFO] Using 'UTF-8' encoding to copy filtered resources.
[INFO] [INFO] Copying 2 resources
[INFO] [INFO] 
[INFO] [INFO] --- license-maven-plugin:3.0:format (format-license-headers) @ wps-client-lib ---
[INFO] [INFO] Updating license headers...
[INFO] [INFO] 
[INFO] [INFO] --- maven-compiler-plugin:3.7.0:compile (default-compile) @ wps-client-lib ---
[INFO] [INFO] Changes detected - recompiling the module!
[INFO] [INFO] Compiling 65 source files to /mnt/extra/jenkins/workspace/wps-client-lib RELEASE/target/checkout/target/classes
[INFO] [INFO] 
[INFO] [INFO] --- maven-resources-plugin:3.0.2:testResources (default-testResources) @ wps-client-lib ---
[INFO] [INFO] Using 'UTF-8' encoding to copy filtered resources.
[INFO] [INFO] Copying 19 resources
[INFO] [INFO] 
[INFO] [INFO] --- maven-compiler-plugin:3.7.0:testCompile (default-testCompile) @ wps-client-lib ---
[INFO] [INFO] Changes detected - recompiling the module!
[INFO] [INFO] Compiling 6 source files to /mnt/extra/jenkins/workspace/wps-client-lib RELEASE/target/checkout/target/test-classes
[INFO] [INFO] 
[INFO] [INFO] --- maven-surefire-plugin:2.21.0:test (default-test) @ wps-client-lib ---
[INFO] [INFO] 
[INFO] [INFO] -------------------------------------------------------
[INFO] [INFO]  T E S T S
[INFO] [INFO] -------------------------------------------------------
[INFO] [INFO] Running org.n52.geoprocessing.wps.client.WPSResponseReaderTest
[INFO] 2018-11-26 09:57:13,721 [main] INFO  org.n52.geoprocessing.wps.client.decoder.stream.GetStatusResponse100Decoder: Status location attribute not present.
[INFO] 2018-11-26 09:57:13,734 [main] INFO  org.n52.geoprocessing.wps.client.decoder.stream.GetStatusResponse100Decoder: Status location attribute not present.
[INFO] 2018-11-26 09:57:13,742 [main] INFO  org.n52.geoprocessing.wps.client.decoder.stream.GetStatusResponse100Decoder: Status location attribute not present.
[INFO] 2018-11-26 09:57:13,791 [main] INFO  org.n52.geoprocessing.wps.client.decoder.stream.GetStatusResponse100Decoder: Status location attribute not present.
[INFO] [INFO] Tests run: 16, Failures: 0, Errors: 0, Skipped: 0, Time elapsed: 0.343 s - in org.n52.geoprocessing.wps.client.WPSResponseReaderTest
[INFO] [INFO] Running org.n52.geoprocessing.wps.client.WPS20ProcessParserTest
[INFO] 2018-11-26 09:57:13,809 [main] INFO  org.n52.geoprocessing.wps.client.WPS20ProcessParserTest: data
[INFO] [INFO] Tests run: 1, Failures: 0, Errors: 0, Skipped: 0, Time elapsed: 0.002 s - in org.n52.geoprocessing.wps.client.WPS20ProcessParserTest
[INFO] [INFO] Running org.n52.geoprocessing.wps.client.ExecuteEncoderTest
[INFO] [INFO] Tests run: 5, Failures: 0, Errors: 0, Skipped: 0, Time elapsed: 0.196 s - in org.n52.geoprocessing.wps.client.ExecuteEncoderTest
[INFO] [INFO] Running org.n52.geoprocessing.wps.client.ExecuteRequestBuilderTest
[INFO] [INFO] Tests run: 1, Failures: 0, Errors: 0, Skipped: 0, Time elapsed: 0 s - in org.n52.geoprocessing.wps.client.ExecuteRequestBuilderTest
[INFO] [INFO] 
[INFO] [INFO] Results:
[INFO] [INFO] 
[INFO] [INFO] Tests run: 23, Failures: 0, Errors: 0, Skipped: 0
[INFO] [INFO] 
[INFO] [INFO] 
[INFO] [INFO] --- maven-jar-plugin:3.0.2:jar (default-jar) @ wps-client-lib ---
[INFO] [INFO] Building jar: /mnt/extra/jenkins/workspace/wps-client-lib RELEASE/target/checkout/target/wps-client-lib-1.0.0.jar
[INFO] [INFO] 
[INFO] [INFO] >>> maven-source-plugin:3.0.1:jar (attach-sources) > generate-sources @ wps-client-lib >>>
[INFO] [INFO] 
[INFO] [INFO] --- git-commit-id-plugin:2.2.4:revision (default) @ wps-client-lib ---
[INFO] [INFO] 
[INFO] [INFO] --- maven-enforcer-plugin:1.4.1:enforce (default) @ wps-client-lib ---
[INFO] [INFO] 
[INFO] [INFO] --- maven-notice-plugin:1.1.0:generate (generate-notice) @ wps-client-lib ---
[INFO] [INFO] Loading license lookup mappings from 'http://52north.github.io/cdn/licenses/license-mappings.xml' (cached)
[INFO] [INFO] Parsing Dependencies for: 52 North WPS Client libary
[INFO] [INFO] 
[INFO] [INFO] <<< maven-source-plugin:3.0.1:jar (attach-sources) < generate-sources @ wps-client-lib <<<
[INFO] [INFO] 
[INFO] [INFO] 
[INFO] [INFO] --- maven-source-plugin:3.0.1:jar (attach-sources) @ wps-client-lib ---
[INFO] [INFO] Building jar: /mnt/extra/jenkins/workspace/wps-client-lib RELEASE/target/checkout/target/wps-client-lib-1.0.0-sources.jar
[INFO] [INFO] 
[INFO] [INFO] >>> maven-source-plugin:3.0.1:jar (default) > generate-sources @ wps-client-lib >>>
[INFO] [INFO] 
[INFO] [INFO] --- git-commit-id-plugin:2.2.4:revision (default) @ wps-client-lib ---
[INFO] [INFO] 
[INFO] [INFO] --- maven-enforcer-plugin:1.4.1:enforce (default) @ wps-client-lib ---
[INFO] [INFO] 
[INFO] [INFO] --- maven-notice-plugin:1.1.0:generate (generate-notice) @ wps-client-lib ---
[INFO] [INFO] Loading license lookup mappings from 'http://52north.github.io/cdn/licenses/license-mappings.xml' (cached)
[INFO] [INFO] Parsing Dependencies for: 52 North WPS Client libary
[INFO] [INFO] 
[INFO] [INFO] <<< maven-source-plugin:3.0.1:jar (default) < generate-sources @ wps-client-lib <<<
[INFO] [INFO] 
[INFO] [INFO] 
[INFO] [INFO] --- maven-source-plugin:3.0.1:jar (default) @ wps-client-lib ---
[INFO] [INFO] Building jar: /mnt/extra/jenkins/workspace/wps-client-lib RELEASE/target/checkout/target/wps-client-lib-1.0.0-sources.jar
[INFO] [INFO] 
[INFO] [INFO] --- maven-javadoc-plugin:3.0.0:jar (attach-javadocs) @ wps-client-lib ---
[INFO] [INFO] Building jar: /mnt/extra/jenkins/workspace/wps-client-lib RELEASE/target/checkout/target/wps-client-lib-1.0.0-javadoc.jar
[INFO] [INFO] 
[INFO] [INFO] --- maven-javadoc-plugin:3.0.0:jar (default) @ wps-client-lib ---
[INFO] [INFO] Building jar: /mnt/extra/jenkins/workspace/wps-client-lib RELEASE/target/checkout/target/wps-client-lib-1.0.0-javadoc.jar
[INFO] [INFO] 
[INFO] [INFO] --- maven-dependency-plugin:3.1.0:analyze-only (analyze-dependencies) @ wps-client-lib ---
[INFO] [INFO] No dependency problems found
[INFO] [INFO] 
[INFO] [INFO] --- maven-gpg-plugin:1.6:sign (sign-artifacts) @ wps-client-lib ---
[INFO] [INFO] 
[INFO] [INFO] >>> findbugs-maven-plugin:3.0.5:check (default) > :findbugs @ wps-client-lib >>>
[INFO] [INFO] 
[INFO] [INFO] --- findbugs-maven-plugin:3.0.5:findbugs (findbugs) @ wps-client-lib ---
[INFO] [INFO] Fork Value is true
[INFO] [INFO] Done FindBugs Analysis....
[INFO] [INFO] 
[INFO] [INFO] <<< findbugs-maven-plugin:3.0.5:check (default) < :findbugs @ wps-client-lib <<<
[INFO] [INFO] 
[INFO] [INFO] 
[INFO] [INFO] --- findbugs-maven-plugin:3.0.5:check (default) @ wps-client-lib ---
[INFO] [INFO] BugInstance size is 0
[INFO] [INFO] Error size is 0
[INFO] [INFO] No errors/warnings found
[INFO] [INFO] 
[INFO] [INFO] --- maven-checkstyle-plugin:2.17:check (default) @ wps-client-lib ---
[INFO] [INFO] Starting audit...
[INFO] [WARN] /mnt/extra/jenkins/workspace/wps-client-lib RELEASE/target/checkout/src/main/java/org/n52/geoprocessing/wps/client/WPSClientSession.java:429: 'case' child has incorrect indentation level 8, expected level should be 12. [Indentation]
[INFO] [WARN] /mnt/extra/jenkins/workspace/wps-client-lib RELEASE/target/checkout/src/main/java/org/n52/geoprocessing/wps/client/WPSClientSession.java:431: 'block' child has incorrect indentation level 12, expected level should be 16. [Indentation]
[INFO] [WARN] /mnt/extra/jenkins/workspace/wps-client-lib RELEASE/target/checkout/src/main/java/org/n52/geoprocessing/wps/client/WPSClientSession.java:433: 'try' has incorrect indentation level 12, expected level should be 16. [Indentation]
[INFO] [WARN] /mnt/extra/jenkins/workspace/wps-client-lib RELEASE/target/checkout/src/main/java/org/n52/geoprocessing/wps/client/WPSClientSession.java:434: 'try' child has incorrect indentation level 16, expected level should be 20. [Indentation]
[INFO] [WARN] /mnt/extra/jenkins/workspace/wps-client-lib RELEASE/target/checkout/src/main/java/org/n52/geoprocessing/wps/client/WPSClientSession.java:436: 'try' child has incorrect indentation level 16, expected level should be 20. [Indentation]
[INFO] [WARN] /mnt/extra/jenkins/workspace/wps-client-lib RELEASE/target/checkout/src/main/java/org/n52/geoprocessing/wps/client/WPSClientSession.java:437: 'try rcurly' has incorrect indentation level 12, expected level should be 16. [Indentation]
[INFO] [WARN] /mnt/extra/jenkins/workspace/wps-client-lib RELEASE/target/checkout/src/main/java/org/n52/geoprocessing/wps/client/WPSClientSession.java:438: 'catch' child has incorrect indentation level 16, expected level should be 20. [Indentation]
[INFO] [WARN] /mnt/extra/jenkins/workspace/wps-client-lib RELEASE/target/checkout/src/main/java/org/n52/geoprocessing/wps/client/WPSClientSession.java:439: 'catch rcurly' has incorrect indentation level 12, expected level should be 16. [Indentation]
[INFO] [WARN] /mnt/extra/jenkins/workspace/wps-client-lib RELEASE/target/checkout/src/main/java/org/n52/geoprocessing/wps/client/WPSClientSession.java:441: 'block' child has incorrect indentation level 12, expected level should be 16. [Indentation]
[INFO] [WARN] /mnt/extra/jenkins/workspace/wps-client-lib RELEASE/target/checkout/src/main/java/org/n52/geoprocessing/wps/client/WPSClientSession.java:443: 'case' child has incorrect indentation level 8, expected level should be 12. [Indentation]
[INFO] [WARN] /mnt/extra/jenkins/workspace/wps-client-lib RELEASE/target/checkout/src/main/java/org/n52/geoprocessing/wps/client/WPSClientSession.java:445: 'block' child has incorrect indentation level 12, expected level should be 16. [Indentation]
[INFO] [WARN] /mnt/extra/jenkins/workspace/wps-client-lib RELEASE/target/checkout/src/main/java/org/n52/geoprocessing/wps/client/WPSClientSession.java:447: 'try' has incorrect indentation level 12, expected level should be 16. [Indentation]
[INFO] [WARN] /mnt/extra/jenkins/workspace/wps-client-lib RELEASE/target/checkout/src/main/java/org/n52/geoprocessing/wps/client/WPSClientSession.java:448: 'try' child has incorrect indentation level 16, expected level should be 20. [Indentation]
[INFO] [WARN] /mnt/extra/jenkins/workspace/wps-client-lib RELEASE/target/checkout/src/main/java/org/n52/geoprocessing/wps/client/WPSClientSession.java:450: 'try' child has incorrect indentation level 16, expected level should be 20. [Indentation]
[INFO] [WARN] /mnt/extra/jenkins/workspace/wps-client-lib RELEASE/target/checkout/src/main/java/org/n52/geoprocessing/wps/client/WPSClientSession.java:451: 'try rcurly' has incorrect indentation level 12, expected level should be 16. [Indentation]
[INFO] [WARN] /mnt/extra/jenkins/workspace/wps-client-lib RELEASE/target/checkout/src/main/java/org/n52/geoprocessing/wps/client/WPSClientSession.java:452: 'catch' child has incorrect indentation level 16, expected level should be 20. [Indentation]
[INFO] [WARN] /mnt/extra/jenkins/workspace/wps-client-lib RELEASE/target/checkout/src/main/java/org/n52/geoprocessing/wps/client/WPSClientSession.java:453: 'catch rcurly' has incorrect indentation level 12, expected level should be 16. [Indentation]
[INFO] [WARN] /mnt/extra/jenkins/workspace/wps-client-lib RELEASE/target/checkout/src/main/java/org/n52/geoprocessing/wps/client/WPSClientSession.java:455: 'block' child has incorrect indentation level 12, expected level should be 16. [Indentation]
[INFO] [WARN] /mnt/extra/jenkins/workspace/wps-client-lib RELEASE/target/checkout/src/main/java/org/n52/geoprocessing/wps/client/WPSClientSession.java:457: 'case' child has incorrect indentation level 8, expected level should be 12. [Indentation]
[INFO] [WARN] /mnt/extra/jenkins/workspace/wps-client-lib RELEASE/target/checkout/src/main/java/org/n52/geoprocessing/wps/client/WPSClientSession.java:458: 'block' child has incorrect indentation level 12, expected level should be 16. [Indentation]
[INFO] Audit done.
[INFO] [INFO] 
[INFO] [INFO] --- maven-install-plugin:2.5.2:install (default-install) @ wps-client-lib ---
[INFO] [INFO] Installing /mnt/extra/jenkins/workspace/wps-client-lib RELEASE/target/checkout/target/wps-client-lib-1.0.0.jar to /mnt/extra/maven-repository/org/n52/geoprocessing/wps-client-lib/1.0.0/wps-client-lib-1.0.0.jar
[INFO] [INFO] Installing /mnt/extra/jenkins/workspace/wps-client-lib RELEASE/target/checkout/pom.xml to /mnt/extra/maven-repository/org/n52/geoprocessing/wps-client-lib/1.0.0/wps-client-lib-1.0.0.pom
[INFO] [INFO] Installing /mnt/extra/jenkins/workspace/wps-client-lib RELEASE/target/checkout/target/wps-client-lib-1.0.0-sources.jar to /mnt/extra/maven-repository/org/n52/geoprocessing/wps-client-lib/1.0.0/wps-client-lib-1.0.0-sources.jar
[INFO] [INFO] Installing /mnt/extra/jenkins/workspace/wps-client-lib RELEASE/target/checkout/target/wps-client-lib-1.0.0-sources.jar to /mnt/extra/maven-repository/org/n52/geoprocessing/wps-client-lib/1.0.0/wps-client-lib-1.0.0-sources.jar
[INFO] [INFO] Installing /mnt/extra/jenkins/workspace/wps-client-lib RELEASE/target/checkout/target/wps-client-lib-1.0.0-javadoc.jar to /mnt/extra/maven-repository/org/n52/geoprocessing/wps-client-lib/1.0.0/wps-client-lib-1.0.0-javadoc.jar
[INFO] [INFO] Installing /mnt/extra/jenkins/workspace/wps-client-lib RELEASE/target/checkout/target/wps-client-lib-1.0.0-javadoc.jar to /mnt/extra/maven-repository/org/n52/geoprocessing/wps-client-lib/1.0.0/wps-client-lib-1.0.0-javadoc.jar
[INFO] [INFO] Installing /mnt/extra/jenkins/workspace/wps-client-lib RELEASE/target/checkout/target/wps-client-lib-1.0.0.jar.asc to /mnt/extra/maven-repository/org/n52/geoprocessing/wps-client-lib/1.0.0/wps-client-lib-1.0.0.jar.asc
[INFO] [INFO] Installing /mnt/extra/jenkins/workspace/wps-client-lib RELEASE/target/checkout/target/wps-client-lib-1.0.0.pom.asc to /mnt/extra/maven-repository/org/n52/geoprocessing/wps-client-lib/1.0.0/wps-client-lib-1.0.0.pom.asc
[INFO] [INFO] Installing /mnt/extra/jenkins/workspace/wps-client-lib RELEASE/target/checkout/target/wps-client-lib-1.0.0-sources.jar.asc to /mnt/extra/maven-repository/org/n52/geoprocessing/wps-client-lib/1.0.0/wps-client-lib-1.0.0-sources.jar.asc
[INFO] [INFO] Installing /mnt/extra/jenkins/workspace/wps-client-lib RELEASE/target/checkout/target/wps-client-lib-1.0.0-sources.jar.asc to /mnt/extra/maven-repository/org/n52/geoprocessing/wps-client-lib/1.0.0/wps-client-lib-1.0.0-sources.jar.asc
[INFO] [INFO] Installing /mnt/extra/jenkins/workspace/wps-client-lib RELEASE/target/checkout/target/wps-client-lib-1.0.0-javadoc.jar.asc to /mnt/extra/maven-repository/org/n52/geoprocessing/wps-client-lib/1.0.0/wps-client-lib-1.0.0-javadoc.jar.asc
[INFO] [INFO] Installing /mnt/extra/jenkins/workspace/wps-client-lib RELEASE/target/checkout/target/wps-client-lib-1.0.0-javadoc.jar.asc to /mnt/extra/maven-repository/org/n52/geoprocessing/wps-client-lib/1.0.0/wps-client-lib-1.0.0-javadoc.jar.asc
[INFO] [INFO] 
[INFO] [INFO] --- maven-dependency-plugin:3.1.0:resolve (download-sources) @ wps-client-lib ---
[INFO] [INFO] 
[INFO] [INFO] --- maven-dependency-plugin:3.1.0:resolve (download-javadoc) @ wps-client-lib ---
[INFO] [INFO] 
[INFO] [INFO] --- maven-assembly-plugin:3.1.0:single (default) @ wps-client-lib ---
[INFO] [INFO] Reading assembly descriptor: src/main/config/assemble.xml
[INFO] [INFO] Copying files to /mnt/extra/jenkins/workspace/wps-client-lib RELEASE/target/checkout/target/wps-client-lib-1.0.0-binaries
[INFO] [WARNING] Assembly file: /mnt/extra/jenkins/workspace/wps-client-lib RELEASE/target/checkout/target/wps-client-lib-1.0.0-binaries is not a regular file (it may be a directory). It cannot be attached to the project build for installation or deployment.
[INFO] [INFO] Building zip: /mnt/extra/jenkins/workspace/wps-client-lib RELEASE/target/checkout/target/wps-client-lib-1.0.0-binaries.zip
[INFO] [INFO] Building tar: /mnt/extra/jenkins/workspace/wps-client-lib RELEASE/target/checkout/target/wps-client-lib-1.0.0-binaries.tar.gz
[INFO] [INFO] 
[INFO] [INFO] --- maven-deploy-plugin:2.8.2:deploy (default-deploy) @ wps-client-lib ---
[INFO] [INFO] Skipping artifact deployment
[INFO] [INFO] 
[INFO] [INFO] --- nexus-staging-maven-plugin:1.6.8:deploy (default) @ wps-client-lib ---
[INFO] [INFO] Performing local staging (local stagingDirectory="/mnt/extra/jenkins/workspace/wps-client-lib RELEASE/target/checkout/target/nexus-staging/staging")...
[INFO] [INFO]  + Using server credentials "sonatype-nexus-snapshots" from Maven settings.
[INFO] [INFO]  * Connected to Nexus at https://oss.sonatype.org:443/, is version 2.14.11-01 and edition "Professional"
[INFO] [INFO]  * Using staging profile ID "682138f1346f3c" (matched by Nexus).
[INFO] [INFO] Installing /mnt/extra/jenkins/workspace/wps-client-lib RELEASE/target/checkout/target/wps-client-lib-1.0.0.jar to /mnt/extra/jenkins/workspace/wps-client-lib RELEASE/target/checkout/target/nexus-staging/staging/682138f1346f3c/org/n52/geoprocessing/wps-client-lib/1.0.0/wps-client-lib-1.0.0.jar
[INFO] [INFO] Installing /mnt/extra/jenkins/workspace/wps-client-lib RELEASE/target/checkout/pom.xml to /mnt/extra/jenkins/workspace/wps-client-lib RELEASE/target/checkout/target/nexus-staging/staging/682138f1346f3c/org/n52/geoprocessing/wps-client-lib/1.0.0/wps-client-lib-1.0.0.pom
[INFO] [INFO] Installing /mnt/extra/jenkins/workspace/wps-client-lib RELEASE/target/checkout/target/wps-client-lib-1.0.0-sources.jar to /mnt/extra/jenkins/workspace/wps-client-lib RELEASE/target/checkout/target/nexus-staging/staging/682138f1346f3c/org/n52/geoprocessing/wps-client-lib/1.0.0/wps-client-lib-1.0.0-sources.jar
[INFO] [INFO] Installing /mnt/extra/jenkins/workspace/wps-client-lib RELEASE/target/checkout/target/wps-client-lib-1.0.0-sources.jar to /mnt/extra/jenkins/workspace/wps-client-lib RELEASE/target/checkout/target/nexus-staging/staging/682138f1346f3c/org/n52/geoprocessing/wps-client-lib/1.0.0/wps-client-lib-1.0.0-sources.jar
[INFO] [INFO] Installing /mnt/extra/jenkins/workspace/wps-client-lib RELEASE/target/checkout/target/wps-client-lib-1.0.0-javadoc.jar to /mnt/extra/jenkins/workspace/wps-client-lib RELEASE/target/checkout/target/nexus-staging/staging/682138f1346f3c/org/n52/geoprocessing/wps-client-lib/1.0.0/wps-client-lib-1.0.0-javadoc.jar
[INFO] [INFO] Installing /mnt/extra/jenkins/workspace/wps-client-lib RELEASE/target/checkout/target/wps-client-lib-1.0.0-javadoc.jar to /mnt/extra/jenkins/workspace/wps-client-lib RELEASE/target/checkout/target/nexus-staging/staging/682138f1346f3c/org/n52/geoprocessing/wps-client-lib/1.0.0/wps-client-lib-1.0.0-javadoc.jar
[INFO] [INFO] Installing /mnt/extra/jenkins/workspace/wps-client-lib RELEASE/target/checkout/target/wps-client-lib-1.0.0.jar.asc to /mnt/extra/jenkins/workspace/wps-client-lib RELEASE/target/checkout/target/nexus-staging/staging/682138f1346f3c/org/n52/geoprocessing/wps-client-lib/1.0.0/wps-client-lib-1.0.0.jar.asc
[INFO] [INFO] Installing /mnt/extra/jenkins/workspace/wps-client-lib RELEASE/target/checkout/target/wps-client-lib-1.0.0.pom.asc to /mnt/extra/jenkins/workspace/wps-client-lib RELEASE/target/checkout/target/nexus-staging/staging/682138f1346f3c/org/n52/geoprocessing/wps-client-lib/1.0.0/wps-client-lib-1.0.0.pom.asc
[INFO] [INFO] Installing /mnt/extra/jenkins/workspace/wps-client-lib RELEASE/target/checkout/target/wps-client-lib-1.0.0-sources.jar.asc to /mnt/extra/jenkins/workspace/wps-client-lib RELEASE/target/checkout/target/nexus-staging/staging/682138f1346f3c/org/n52/geoprocessing/wps-client-lib/1.0.0/wps-client-lib-1.0.0-sources.jar.asc
[INFO] [INFO] Installing /mnt/extra/jenkins/workspace/wps-client-lib RELEASE/target/checkout/target/wps-client-lib-1.0.0-sources.jar.asc to /mnt/extra/jenkins/workspace/wps-client-lib RELEASE/target/checkout/target/nexus-staging/staging/682138f1346f3c/org/n52/geoprocessing/wps-client-lib/1.0.0/wps-client-lib-1.0.0-sources.jar.asc
[INFO] [INFO] Installing /mnt/extra/jenkins/workspace/wps-client-lib RELEASE/target/checkout/target/wps-client-lib-1.0.0-javadoc.jar.asc to /mnt/extra/jenkins/workspace/wps-client-lib RELEASE/target/checkout/target/nexus-staging/staging/682138f1346f3c/org/n52/geoprocessing/wps-client-lib/1.0.0/wps-client-lib-1.0.0-javadoc.jar.asc
[INFO] [INFO] Installing /mnt/extra/jenkins/workspace/wps-client-lib RELEASE/target/checkout/target/wps-client-lib-1.0.0-javadoc.jar.asc to /mnt/extra/jenkins/workspace/wps-client-lib RELEASE/target/checkout/target/nexus-staging/staging/682138f1346f3c/org/n52/geoprocessing/wps-client-lib/1.0.0/wps-client-lib-1.0.0-javadoc.jar.asc
[INFO] [INFO] Installing /mnt/extra/jenkins/workspace/wps-client-lib RELEASE/target/checkout/target/wps-client-lib-1.0.0-binaries.zip to /mnt/extra/jenkins/workspace/wps-client-lib RELEASE/target/checkout/target/nexus-staging/staging/682138f1346f3c/org/n52/geoprocessing/wps-client-lib/1.0.0/wps-client-lib-1.0.0-binaries.zip
[INFO] [INFO] Installing /mnt/extra/jenkins/workspace/wps-client-lib RELEASE/target/checkout/target/wps-client-lib-1.0.0-binaries.tar.gz to /mnt/extra/jenkins/workspace/wps-client-lib RELEASE/target/checkout/target/nexus-staging/staging/682138f1346f3c/org/n52/geoprocessing/wps-client-lib/1.0.0/wps-client-lib-1.0.0-binaries.tar.gz
[INFO] [INFO] Performing remote staging...
[INFO] [INFO] 
[INFO] [INFO]  * Remote staging into staging profile ID "682138f1346f3c"
[INFO] [INFO]  * Created staging repository with ID "orgn52-1123".
[INFO] [INFO]  * Staging repository at https://oss.sonatype.org:443/service/local/staging/deployByRepositoryId/orgn52-1123
[INFO] [INFO]  * Uploading locally staged artifacts to profile org.n52
[INFO] [INFO] Uploading to sonatype-nexus-snapshots: https://oss.sonatype.org:443/service/local/staging/deployByRepositoryId/orgn52-1123/org/n52/geoprocessing/wps-client-lib/1.0.0/wps-client-lib-1.0.0.jar.asc
[INFO] [INFO] Uploaded to sonatype-nexus-snapshots: https://oss.sonatype.org:443/service/local/staging/deployByRepositoryId/orgn52-1123/org/n52/geoprocessing/wps-client-lib/1.0.0/wps-client-lib-1.0.0.jar.asc (490 B at 889 B/s)
[INFO] [INFO] Downloading from sonatype-nexus-snapshots: https://oss.sonatype.org:443/service/local/staging/deployByRepositoryId/orgn52-1123/org/n52/geoprocessing/wps-client-lib/maven-metadata.xml
[INFO] [INFO] Uploading to sonatype-nexus-snapshots: https://oss.sonatype.org:443/service/local/staging/deployByRepositoryId/orgn52-1123/org/n52/geoprocessing/wps-client-lib/maven-metadata.xml
[INFO] [INFO] Uploaded to sonatype-nexus-snapshots: https://oss.sonatype.org:443/service/local/staging/deployByRepositoryId/orgn52-1123/org/n52/geoprocessing/wps-client-lib/maven-metadata.xml (315 B at 348 B/s)
[INFO] [INFO] Uploading to sonatype-nexus-snapshots: https://oss.sonatype.org:443/service/local/staging/deployByRepositoryId/orgn52-1123/org/n52/geoprocessing/wps-client-lib/1.0.0/wps-client-lib-1.0.0-binaries.tar.gz
[INFO] [INFO] Uploaded to sonatype-nexus-snapshots: https://oss.sonatype.org:443/service/local/staging/deployByRepositoryId/orgn52-1123/org/n52/geoprocessing/wps-client-lib/1.0.0/wps-client-lib-1.0.0-binaries.tar.gz (8.8 MB at 3.3 MB/s)
[INFO] [INFO] Uploading to sonatype-nexus-snapshots: https://oss.sonatype.org:443/service/local/staging/deployByRepositoryId/orgn52-1123/org/n52/geoprocessing/wps-client-lib/1.0.0/wps-client-lib-1.0.0-sources.jar
[INFO] [INFO] Uploaded to sonatype-nexus-snapshots: https://oss.sonatype.org:443/service/local/staging/deployByRepositoryId/orgn52-1123/org/n52/geoprocessing/wps-client-lib/1.0.0/wps-client-lib-1.0.0-sources.jar (94 kB at 156 kB/s)
[INFO] [INFO] Uploading to sonatype-nexus-snapshots: https://oss.sonatype.org:443/service/local/staging/deployByRepositoryId/orgn52-1123/org/n52/geoprocessing/wps-client-lib/1.0.0/wps-client-lib-1.0.0.pom.asc
[INFO] [INFO] Uploaded to sonatype-nexus-snapshots: https://oss.sonatype.org:443/service/local/staging/deployByRepositoryId/orgn52-1123/org/n52/geoprocessing/wps-client-lib/1.0.0/wps-client-lib-1.0.0.pom.asc (490 B at 2.5 kB/s)
[INFO] [INFO] Uploading to sonatype-nexus-snapshots: https://oss.sonatype.org:443/service/local/staging/deployByRepositoryId/orgn52-1123/org/n52/geoprocessing/wps-client-lib/1.0.0/wps-client-lib-1.0.0.jar
[INFO] [INFO] Uploaded to sonatype-nexus-snapshots: https://oss.sonatype.org:443/service/local/staging/deployByRepositoryId/orgn52-1123/org/n52/geoprocessing/wps-client-lib/1.0.0/wps-client-lib-1.0.0.jar (133 kB at 228 kB/s)
[INFO] [INFO] Uploading to sonatype-nexus-snapshots: https://oss.sonatype.org:443/service/local/staging/deployByRepositoryId/orgn52-1123/org/n52/geoprocessing/wps-client-lib/1.0.0/wps-client-lib-1.0.0.pom
[INFO] [INFO] Uploaded to sonatype-nexus-snapshots: https://oss.sonatype.org:443/service/local/staging/deployByRepositoryId/orgn52-1123/org/n52/geoprocessing/wps-client-lib/1.0.0/wps-client-lib-1.0.0.pom (12 kB at 21 kB/s)
[INFO] [INFO] Uploading to sonatype-nexus-snapshots: https://oss.sonatype.org:443/service/local/staging/deployByRepositoryId/orgn52-1123/org/n52/geoprocessing/wps-client-lib/1.0.0/wps-client-lib-1.0.0-javadoc.jar
[INFO] [INFO] Uploaded to sonatype-nexus-snapshots: https://oss.sonatype.org:443/service/local/staging/deployByRepositoryId/orgn52-1123/org/n52/geoprocessing/wps-client-lib/1.0.0/wps-client-lib-1.0.0-javadoc.jar (438 kB at 738 kB/s)
[INFO] [INFO] Uploading to sonatype-nexus-snapshots: https://oss.sonatype.org:443/service/local/staging/deployByRepositoryId/orgn52-1123/org/n52/geoprocessing/wps-client-lib/1.0.0/wps-client-lib-1.0.0-javadoc.jar.asc
[INFO] [INFO] Uploaded to sonatype-nexus-snapshots: https://oss.sonatype.org:443/service/local/staging/deployByRepositoryId/orgn52-1123/org/n52/geoprocessing/wps-client-lib/1.0.0/wps-client-lib-1.0.0-javadoc.jar.asc (490 B at 2.5 kB/s)
[INFO] [INFO] Uploading to sonatype-nexus-snapshots: https://oss.sonatype.org:443/service/local/staging/deployByRepositoryId/orgn52-1123/org/n52/geoprocessing/wps-client-lib/1.0.0/wps-client-lib-1.0.0-sources.jar.asc
[INFO] [INFO] Uploaded to sonatype-nexus-snapshots: https://oss.sonatype.org:443/service/local/staging/deployByRepositoryId/orgn52-1123/org/n52/geoprocessing/wps-client-lib/1.0.0/wps-client-lib-1.0.0-sources.jar.asc (490 B at 2.5 kB/s)
[INFO] [INFO] Uploading to sonatype-nexus-snapshots: https://oss.sonatype.org:443/service/local/staging/deployByRepositoryId/orgn52-1123/org/n52/geoprocessing/wps-client-lib/1.0.0/wps-client-lib-1.0.0-binaries.zip
[INFO] [INFO] Uploaded to sonatype-nexus-snapshots: https://oss.sonatype.org:443/service/local/staging/deployByRepositoryId/orgn52-1123/org/n52/geoprocessing/wps-client-lib/1.0.0/wps-client-lib-1.0.0-binaries.zip (8.8 MB at 7.1 MB/s)
[INFO] [INFO]  * Upload of locally staged artifacts finished.
[INFO] [INFO]  * Closing staging repository with ID "orgn52-1123".
[INFO] 
[INFO] Waiting for operation to complete...
[INFO] .....
[INFO] 
[INFO] [ERROR] Rule failure while trying to close staging repository with ID "orgn52-1123".
[INFO] [ERROR] 
[INFO] [ERROR] Nexus Staging Rules Failure Report
[INFO] [ERROR] ==================================
[INFO] [ERROR] 
[INFO] [ERROR] Repository "orgn52-1123" failures
[INFO] [ERROR]   Rule "signature-staging" failures
[INFO] [ERROR]     * Missing Signature: '/org/n52/geoprocessing/wps-client-lib/1.0.0/wps-client-lib-1.0.0-binaries.zip.asc' does not exist for 'wps-client-lib-1.0.0-binaries.zip'.
[INFO] [ERROR]     * Missing Signature: '/org/n52/geoprocessing/wps-client-lib/1.0.0/wps-client-lib-1.0.0-binaries.tar.gz.asc' does not exist for 'wps-client-lib-1.0.0-binaries.tar.gz'.
[INFO] [ERROR] 
[INFO] [ERROR] 
[INFO] [ERROR] Cleaning up local stage directory after a Rule failure during close of staging repositories: [orgn52-1123]
[INFO] [ERROR]  * Deleting context 682138f1346f3c.properties
[INFO] [ERROR] Cleaning up remote stage repositories after a Rule failure during close of staging repositories: [orgn52-1123]
[INFO] [ERROR]  * Dropping failed staging repository with ID "orgn52-1123" (Rule failure during close of staging repositories: [orgn52-1123]).
[INFO] 
[INFO] Waiting for operation to complete...
[INFO] ...
[INFO] 
[INFO] [ERROR] Remote staging finished with a failure: Staging rules failure!
[INFO] [INFO] ------------------------------------------------------------------------
[INFO] [INFO] BUILD FAILURE
[INFO] [INFO] ------------------------------------------------------------------------
[INFO] [INFO] Total time: 01:05 min
[INFO] [INFO] Finished at: 2018-11-26T09:58:14Z
[INFO] [INFO] ------------------------------------------------------------------------
[INFO] [ERROR] Failed to execute goal org.sonatype.plugins:nexus-staging-maven-plugin:1.6.8:deploy (default) on project wps-client-lib: Remote staging failed: Staging rules failure! -> [Help 1]
[INFO] [ERROR] 
[INFO] [ERROR] To see the full stack trace of the errors, re-run Maven with the -e switch.
[INFO] [ERROR] Re-run Maven using the -X switch to enable full debug logging.
[INFO] [ERROR] 
[INFO] [ERROR] For more information about the errors and possible solutions, please read the following articles:
[INFO] [ERROR] [Help 1] http://cwiki.apache.org/confluence/display/MAVEN/MojoExecutionException
[WARNING] Attempt to (de-)serialize anonymous class hudson.maven.reporters.MavenArtifactArchiver$2; see: https://jenkins.io/redirect/serialization-of-anonymous-classes/
[WARNING] Attempt to (de-)serialize anonymous class hudson.maven.reporters.MavenFingerprinter$1; see: https://jenkins.io/redirect/serialization-of-anonymous-classes/
[INFO] ------------------------------------------------------------------------
[INFO] BUILD FAILURE
[INFO] ------------------------------------------------------------------------
[INFO] Total time: 01:32 min
[INFO] Finished at: 2018-11-26T09:58:14Z
[INFO] ------------------------------------------------------------------------
Waiting for Jenkins to finish collecting data[ERROR] Failed to execute goal org.apache.maven.plugins:maven-release-plugin:2.5.3:perform (default-cli) on project wps-client-lib: Maven execution failed, exit code: '1' -> [Help 1]
[ERROR] 
[ERROR] To see the full stack trace of the errors, re-run Maven with the -e switch.
[ERROR] Re-run Maven using the -X switch to enable full debug logging.
[ERROR] 
[ERROR] For more information about the errors and possible solutions, please read the following articles:
[ERROR] [Help 1] http://cwiki.apache.org/confluence/display/MAVEN/MojoExecutionException

[JENKINS] Archiving /var/lib/jenkins/workspace/wps-client-lib RELEASE/pom.xml to org.n52.geoprocessing/wps-client-lib/1.0.0-SNAPSHOT/wps-client-lib-1.0.0-SNAPSHOT.pom
channel stopped
Sending e-mails to: b.pross@52north.org
Finished: FAILURE