Console Output

Started by user BenjaminPross
Building in workspace /var/lib/jenkins/workspace/wps-client-lib RELEASE
 > git rev-parse --is-inside-work-tree # timeout=10
Fetching changes from the remote Git repository
 > git config remote.origin.url https://github.com/52North/wps-client-lib.git # timeout=10
Fetching upstream changes from https://github.com/52North/wps-client-lib.git
 > git --version # timeout=10
 > git fetch --tags --progress https://github.com/52North/wps-client-lib.git +refs/heads/*:refs/remotes/origin/*
 > git rev-parse origin/master^{commit} # timeout=10
Checking out Revision 4e0a4bff2105ba5a8efc889675cd849c24b5131d (origin/master)
 > git config core.sparsecheckout # timeout=10
 > git checkout -f 4e0a4bff2105ba5a8efc889675cd849c24b5131d
 > git branch -a -v --no-abbrev # timeout=10
 > git branch -D master # timeout=10
 > git checkout -b master 4e0a4bff2105ba5a8efc889675cd849c24b5131d
Commit message: "Merge pull request #3 from bpross-52n/master"
 > git rev-list --no-walk 4e0a4bff2105ba5a8efc889675cd849c24b5131d # timeout=10
Parsing POMs
Established TCP socket on 52581
[wps-client-lib RELEASE] $ /var/lib/jenkins/tools/hudson.model.JDK/Java-1.8_161/bin/java -Xmx1024m -XX:MaxPermSize=1024m -cp /var/lib/jenkins/plugins/maven-plugin/WEB-INF/lib/maven35-agent-1.12-alpha-1.jar:/var/lib/jenkins/tools/hudson.tasks.Maven_MavenInstallation/Maven353/boot/plexus-classworlds-2.5.2.jar:/var/lib/jenkins/tools/hudson.tasks.Maven_MavenInstallation/Maven353/conf/logging jenkins.maven3.agent.Maven35Main /var/lib/jenkins/tools/hudson.tasks.Maven_MavenInstallation/Maven353 /var/cache/jenkins/war/WEB-INF/lib/remoting-3.26.jar /var/lib/jenkins/plugins/maven-plugin/WEB-INF/lib/maven35-interceptor-1.12-alpha-1.jar /var/lib/jenkins/plugins/maven-plugin/WEB-INF/lib/maven3-interceptor-commons-1.12-alpha-1.jar 52581
Java HotSpot(TM) 64-Bit Server VM warning: ignoring option MaxPermSize=1024m; support was removed in 8.0
<===[JENKINS REMOTING CAPACITY]===>channel started
Executing Maven:  -B -f /var/lib/jenkins/workspace/wps-client-lib RELEASE/pom.xml -DdevelopmentVersion=1.0.1-SNAPSHOT -DreleaseVersion=1.0.0 -Dtag=v1.0.0 -Dresume=false release:prepare release:perform
[INFO] Scanning for projects...
[INFO] 
[INFO] ----------------< org.n52.geoprocessing:wps-client-lib >----------------
[INFO] Building 52 North WPS Client libary 1.0.0-SNAPSHOT
[INFO] --------------------------------[ jar ]---------------------------------
[INFO] 
[INFO] --- maven-release-plugin:2.5.3:prepare (default-cli) @ wps-client-lib ---
[INFO] Verifying that there are no local modifications...
[INFO]   ignoring changes on: **/pom.xml.releaseBackup, **/pom.xml.next, **/pom.xml.tag, **/pom.xml.branch, **/release.properties, **/pom.xml.backup
[INFO] Executing: /bin/sh -c cd "/var/lib/jenkins/workspace/wps-client-lib RELEASE" && git rev-parse --show-toplevel
[INFO] Working directory: /var/lib/jenkins/workspace/wps-client-lib RELEASE
[INFO] Executing: /bin/sh -c cd "/var/lib/jenkins/workspace/wps-client-lib RELEASE" && git status --porcelain .
[INFO] Working directory: /var/lib/jenkins/workspace/wps-client-lib RELEASE
[WARNING] Ignoring unrecognized line: ?? pom.xml.releaseBackup
[WARNING] Ignoring unrecognized line: ?? release.properties
[WARNING] Ignoring unrecognized line: ?? wps-client.log
[INFO] Checking dependencies and plugins for snapshots ...
[INFO] Transforming '52 North WPS Client libary'...
[INFO] Not generating release POMs
[INFO] Executing goals 'clean install'...
[INFO] Java HotSpot(TM) 64-Bit Server VM warning: ignoring option MaxPermSize=1024m; support was removed in 8.0
[INFO] [INFO] Scanning for projects...
[INFO] [INFO] 
[INFO] [INFO] ----------------< org.n52.geoprocessing:wps-client-lib >----------------
[INFO] [INFO] Building 52 North WPS Client libary 1.0.0
[INFO] [INFO] --------------------------------[ jar ]---------------------------------
[INFO] [INFO] 
[INFO] [INFO] --- maven-clean-plugin:3.0.0:clean (default-clean) @ wps-client-lib ---
[INFO] [INFO] Deleting /mnt/extra/jenkins/workspace/wps-client-lib RELEASE/target
[INFO] [INFO] 
[INFO] [INFO] --- git-commit-id-plugin:2.2.4:revision (default) @ wps-client-lib ---
[INFO] [INFO] 
[INFO] [INFO] --- maven-enforcer-plugin:1.4.1:enforce (default) @ wps-client-lib ---
[INFO] [INFO] 
[INFO] [INFO] --- maven-notice-plugin:1.1.0:generate (generate-notice) @ wps-client-lib ---
[INFO] [INFO] Loading license lookup mappings from 'http://52north.github.io/cdn/licenses/license-mappings.xml'
[INFO] [INFO] Parsing Dependencies for: 52 North WPS Client libary
[INFO] [INFO] 
[INFO] [INFO] --- whitespace-maven-plugin:1.0.4:trim (default) @ wps-client-lib ---
[INFO] [INFO] 
[INFO] [INFO] --- maven-resources-plugin:3.0.2:resources (default-resources) @ wps-client-lib ---
[INFO] [INFO] Using 'UTF-8' encoding to copy filtered resources.
[INFO] [INFO] Copying 2 resources
[INFO] [INFO] 
[INFO] [INFO] --- license-maven-plugin:3.0:format (format-license-headers) @ wps-client-lib ---
[INFO] [INFO] Updating license headers...
[INFO] [INFO] Updating license header in: /mnt/extra/jenkins/workspace/wps-client-lib RELEASE/pom.xml
[INFO] [INFO] 
[INFO] [INFO] --- maven-compiler-plugin:3.7.0:compile (default-compile) @ wps-client-lib ---
[INFO] [INFO] Changes detected - recompiling the module!
[INFO] [INFO] Compiling 65 source files to /mnt/extra/jenkins/workspace/wps-client-lib RELEASE/target/classes
[INFO] [INFO] 
[INFO] [INFO] --- maven-resources-plugin:3.0.2:testResources (default-testResources) @ wps-client-lib ---
[INFO] [INFO] Using 'UTF-8' encoding to copy filtered resources.
[INFO] [INFO] Copying 19 resources
[INFO] [INFO] 
[INFO] [INFO] --- maven-compiler-plugin:3.7.0:testCompile (default-testCompile) @ wps-client-lib ---
[INFO] [INFO] Changes detected - recompiling the module!
[INFO] [INFO] Compiling 6 source files to /mnt/extra/jenkins/workspace/wps-client-lib RELEASE/target/test-classes
[INFO] [INFO] 
[INFO] [INFO] --- maven-surefire-plugin:2.21.0:test (default-test) @ wps-client-lib ---
[INFO] [INFO] 
[INFO] [INFO] -------------------------------------------------------
[INFO] [INFO]  T E S T S
[INFO] [INFO] -------------------------------------------------------
[INFO] [INFO] Running org.n52.geoprocessing.wps.client.WPSResponseReaderTest
[INFO] 2018-11-26 09:50:07,605 [main] INFO  org.n52.geoprocessing.wps.client.decoder.stream.GetStatusResponse100Decoder: Status location attribute not present.
[INFO] 2018-11-26 09:50:07,620 [main] INFO  org.n52.geoprocessing.wps.client.decoder.stream.GetStatusResponse100Decoder: Status location attribute not present.
[INFO] 2018-11-26 09:50:07,628 [main] INFO  org.n52.geoprocessing.wps.client.decoder.stream.GetStatusResponse100Decoder: Status location attribute not present.
[INFO] 2018-11-26 09:50:07,691 [main] INFO  org.n52.geoprocessing.wps.client.decoder.stream.GetStatusResponse100Decoder: Status location attribute not present.
[INFO] [INFO] Tests run: 16, Failures: 0, Errors: 0, Skipped: 0, Time elapsed: 0.406 s - in org.n52.geoprocessing.wps.client.WPSResponseReaderTest
[INFO] [INFO] Running org.n52.geoprocessing.wps.client.WPS20ProcessParserTest
[INFO] 2018-11-26 09:50:07,703 [main] INFO  org.n52.geoprocessing.wps.client.WPS20ProcessParserTest: data
[INFO] [INFO] Tests run: 1, Failures: 0, Errors: 0, Skipped: 0, Time elapsed: 0.001 s - in org.n52.geoprocessing.wps.client.WPS20ProcessParserTest
[INFO] [INFO] Running org.n52.geoprocessing.wps.client.ExecuteEncoderTest
[INFO] [INFO] Tests run: 5, Failures: 0, Errors: 0, Skipped: 0, Time elapsed: 0.236 s - in org.n52.geoprocessing.wps.client.ExecuteEncoderTest
[INFO] [INFO] Running org.n52.geoprocessing.wps.client.ExecuteRequestBuilderTest
[INFO] [INFO] Tests run: 1, Failures: 0, Errors: 0, Skipped: 0, Time elapsed: 0 s - in org.n52.geoprocessing.wps.client.ExecuteRequestBuilderTest
[INFO] [INFO] 
[INFO] [INFO] Results:
[INFO] [INFO] 
[INFO] [INFO] Tests run: 23, Failures: 0, Errors: 0, Skipped: 0
[INFO] [INFO] 
[INFO] [INFO] 
[INFO] [INFO] --- maven-jar-plugin:3.0.2:jar (default-jar) @ wps-client-lib ---
[INFO] [INFO] Building jar: /mnt/extra/jenkins/workspace/wps-client-lib RELEASE/target/wps-client-lib-1.0.0.jar
[INFO] [INFO] 
[INFO] [INFO] >>> maven-source-plugin:3.0.1:jar (default) > generate-sources @ wps-client-lib >>>
[INFO] [INFO] 
[INFO] [INFO] --- git-commit-id-plugin:2.2.4:revision (default) @ wps-client-lib ---
[INFO] [INFO] 
[INFO] [INFO] --- maven-enforcer-plugin:1.4.1:enforce (default) @ wps-client-lib ---
[INFO] [INFO] 
[INFO] [INFO] --- maven-notice-plugin:1.1.0:generate (generate-notice) @ wps-client-lib ---
[INFO] [INFO] Loading license lookup mappings from 'http://52north.github.io/cdn/licenses/license-mappings.xml' (cached)
[INFO] [INFO] Parsing Dependencies for: 52 North WPS Client libary
[INFO] [INFO] 
[INFO] [INFO] <<< maven-source-plugin:3.0.1:jar (default) < generate-sources @ wps-client-lib <<<
[INFO] [INFO] 
[INFO] [INFO] 
[INFO] [INFO] --- maven-source-plugin:3.0.1:jar (default) @ wps-client-lib ---
[INFO] [INFO] Building jar: /mnt/extra/jenkins/workspace/wps-client-lib RELEASE/target/wps-client-lib-1.0.0-sources.jar
[INFO] [INFO] 
[INFO] [INFO] --- maven-javadoc-plugin:3.0.0:jar (default) @ wps-client-lib ---
[INFO] [INFO] Building jar: /mnt/extra/jenkins/workspace/wps-client-lib RELEASE/target/wps-client-lib-1.0.0-javadoc.jar
[INFO] [INFO] 
[INFO] [INFO] --- maven-dependency-plugin:3.1.0:analyze-only (analyze-dependencies) @ wps-client-lib ---
[INFO] [INFO] No dependency problems found
[INFO] [INFO] 
[INFO] [INFO] --- maven-install-plugin:2.5.2:install (default-install) @ wps-client-lib ---
[INFO] [INFO] Installing /mnt/extra/jenkins/workspace/wps-client-lib RELEASE/target/wps-client-lib-1.0.0.jar to /mnt/extra/maven-repository/org/n52/geoprocessing/wps-client-lib/1.0.0/wps-client-lib-1.0.0.jar
[INFO] [INFO] Installing /mnt/extra/jenkins/workspace/wps-client-lib RELEASE/pom.xml to /mnt/extra/maven-repository/org/n52/geoprocessing/wps-client-lib/1.0.0/wps-client-lib-1.0.0.pom
[INFO] [INFO] Installing /mnt/extra/jenkins/workspace/wps-client-lib RELEASE/target/wps-client-lib-1.0.0-sources.jar to /mnt/extra/maven-repository/org/n52/geoprocessing/wps-client-lib/1.0.0/wps-client-lib-1.0.0-sources.jar
[INFO] [INFO] Installing /mnt/extra/jenkins/workspace/wps-client-lib RELEASE/target/wps-client-lib-1.0.0-javadoc.jar to /mnt/extra/maven-repository/org/n52/geoprocessing/wps-client-lib/1.0.0/wps-client-lib-1.0.0-javadoc.jar
[INFO] [INFO] 
[INFO] [INFO] --- maven-dependency-plugin:3.1.0:resolve (download-sources) @ wps-client-lib ---
[INFO] [INFO] 
[INFO] [INFO] --- maven-dependency-plugin:3.1.0:resolve (download-javadoc) @ wps-client-lib ---
[INFO] [INFO] 
[INFO] [INFO] --- maven-assembly-plugin:3.1.0:single (default) @ wps-client-lib ---
[INFO] [INFO] Reading assembly descriptor: src/main/config/assemble.xml
[INFO] [INFO] Copying files to /mnt/extra/jenkins/workspace/wps-client-lib RELEASE/target/wps-client-lib-1.0.0-binaries
[INFO] [WARNING] Assembly file: /mnt/extra/jenkins/workspace/wps-client-lib RELEASE/target/wps-client-lib-1.0.0-binaries is not a regular file (it may be a directory). It cannot be attached to the project build for installation or deployment.
[INFO] [INFO] Building zip: /mnt/extra/jenkins/workspace/wps-client-lib RELEASE/target/wps-client-lib-1.0.0-binaries.zip
[INFO] [INFO] Building tar: /mnt/extra/jenkins/workspace/wps-client-lib RELEASE/target/wps-client-lib-1.0.0-binaries.tar.gz
[INFO] [INFO] ------------------------------------------------------------------------
[INFO] [INFO] BUILD SUCCESS
[INFO] [INFO] ------------------------------------------------------------------------
[INFO] [INFO] Total time: 10.389 s
[INFO] [INFO] Finished at: 2018-11-26T09:50:13Z
[INFO] [INFO] ------------------------------------------------------------------------
[INFO] Checking in modified POMs...
[INFO] Executing: /bin/sh -c cd "/var/lib/jenkins/workspace/wps-client-lib RELEASE" && git add -- pom.xml
[INFO] Working directory: /var/lib/jenkins/workspace/wps-client-lib RELEASE
[INFO] Executing: /bin/sh -c cd "/var/lib/jenkins/workspace/wps-client-lib RELEASE" && git rev-parse --show-toplevel
[INFO] Working directory: /var/lib/jenkins/workspace/wps-client-lib RELEASE
[INFO] Executing: /bin/sh -c cd "/var/lib/jenkins/workspace/wps-client-lib RELEASE" && git status --porcelain .
[INFO] Working directory: /var/lib/jenkins/workspace/wps-client-lib RELEASE
[WARNING] Ignoring unrecognized line: ?? pom.xml.releaseBackup
[WARNING] Ignoring unrecognized line: ?? release.properties
[WARNING] Ignoring unrecognized line: ?? wps-client.log
[INFO] Executing: /bin/sh -c cd "/var/lib/jenkins/workspace/wps-client-lib RELEASE" && git commit --verbose -F /tmp/maven-scm-98994891.commit pom.xml
[INFO] Working directory: /var/lib/jenkins/workspace/wps-client-lib RELEASE
[INFO] Executing: /bin/sh -c cd "/var/lib/jenkins/workspace/wps-client-lib RELEASE" && git symbolic-ref HEAD
[INFO] Working directory: /var/lib/jenkins/workspace/wps-client-lib RELEASE
[INFO] Executing: /bin/sh -c cd "/var/lib/jenkins/workspace/wps-client-lib RELEASE" && git push ssh:********@github.com/52North/wps-client-lib.git refs/heads/master:refs/heads/master
[INFO] Working directory: /var/lib/jenkins/workspace/wps-client-lib RELEASE
[WARNING] Attempt to (de-)serialize anonymous class hudson.maven.reporters.MavenArtifactArchiver$2; see: https://jenkins.io/redirect/serialization-of-anonymous-classes/
[WARNING] Attempt to (de-)serialize anonymous class hudson.maven.reporters.MavenFingerprinter$1; see: https://jenkins.io/redirect/serialization-of-anonymous-classes/
[INFO] ------------------------------------------------------------------------
[INFO] BUILD FAILURE
[INFO] ------------------------------------------------------------------------
[INFO] Total time: 15.640 s
[INFO] Finished at: 2018-11-26T09:50:16Z
[INFO] ------------------------------------------------------------------------
Waiting for Jenkins to finish collecting data[ERROR] Failed to execute goal org.apache.maven.plugins:maven-release-plugin:2.5.3:prepare (default-cli) on project wps-client-lib: Unable to commit files
[ERROR] Provider message:
[ERROR] The git-push command failed.
[ERROR] Command output:
[ERROR] ERROR: Permission to 52North/wps-client-lib.git denied to 52n-jenkins.
[ERROR] fatal: The remote end hung up unexpectedly
[ERROR] -> [Help 1]
[ERROR] 
[ERROR] To see the full stack trace of the errors, re-run Maven with the -e switch.
[ERROR] Re-run Maven using the -X switch to enable full debug logging.
[ERROR] 
[ERROR] For more information about the errors and possible solutions, please read the following articles:
[ERROR] [Help 1] http://cwiki.apache.org/confluence/display/MAVEN/MojoFailureException

[JENKINS] Archiving /var/lib/jenkins/workspace/wps-client-lib RELEASE/pom.xml to org.n52.geoprocessing/wps-client-lib/1.0.0-SNAPSHOT/wps-client-lib-1.0.0-SNAPSHOT.pom
channel stopped
Sending e-mails to: b.pross@52north.org
Finished: FAILURE