Console Output

Started by an SCM change
Running as SYSTEM
Building in workspace /var/lib/jenkins/workspace/sos-proxy-dev
No credentials specified
 > git rev-parse --is-inside-work-tree # timeout=10
Fetching changes from the remote Git repository
 > git config remote.origin.url https://github.com/52North/series-sos-proxy # timeout=10
Fetching upstream changes from https://github.com/52North/series-sos-proxy
 > git --version # timeout=10
 > git fetch --tags --progress -- https://github.com/52North/series-sos-proxy +refs/heads/*:refs/remotes/origin/* # timeout=10
 > git rev-parse refs/remotes/origin/develop^{commit} # timeout=10
 > git rev-parse refs/remotes/origin/origin/develop^{commit} # timeout=10
Checking out Revision 8332f4e89ca63d8c1d57c3578c528ec7b530877d (refs/remotes/origin/develop)
 > git config core.sparsecheckout # timeout=10
 > git checkout -f 8332f4e89ca63d8c1d57c3578c528ec7b530877d # timeout=10
Commit message: "Merge pull request #45 from 52North/dependabot/maven/org.postgresql-postgresql-42.2.10"
 > git rev-list --no-walk f6af7ec962041d8461119fa7a3a7e94561cd6751 # timeout=10
 > git tag -a -f -m Jenkins Build #982 jenkins-sos-proxy-dev-982 # timeout=10
Parsing POMs
Modules changed, recalculating dependency graph
Established TCP socket on 32979
[sos-proxy-dev] $ /var/lib/jenkins/tools/hudson.model.JDK/Java-1.8/bin/java -Xmx1024m -XX:MaxPermSize=1024m -cp /var/lib/jenkins/plugins/maven-plugin/WEB-INF/lib/maven35-agent-1.13.jar:/var/lib/jenkins/tools/hudson.tasks.Maven_MavenInstallation/Maven_3.x/boot/plexus-classworlds-2.5.2.jar:/var/lib/jenkins/tools/hudson.tasks.Maven_MavenInstallation/Maven_3.x/conf/logging jenkins.maven3.agent.Maven35Main /var/lib/jenkins/tools/hudson.tasks.Maven_MavenInstallation/Maven_3.x /var/cache/jenkins/war/WEB-INF/lib/remoting-4.2.jar /var/lib/jenkins/plugins/maven-plugin/WEB-INF/lib/maven35-interceptor-1.13.jar /var/lib/jenkins/plugins/maven-plugin/WEB-INF/lib/maven3-interceptor-commons-1.13.jar 32979
Java HotSpot(TM) 64-Bit Server VM warning: ignoring option MaxPermSize=1024m; support was removed in 8.0
<===[JENKINS REMOTING CAPACITY]===>channel started
Executing Maven:  -B -f /var/lib/jenkins/workspace/sos-proxy-dev/pom.xml clean install -Denv=ci
[INFO] Scanning for projects...
[WARNING] 
[WARNING] Some problems were encountered while building the effective model for org.n52.series-api:proxy-dao:jar:2.0.0-SNAPSHOT
[WARNING] 'dependencies.dependency.(groupId:artifactId:type:classifier)' must be unique: ch.qos.logback:logback-classic:jar -> duplicate declaration of version (?) @ org.n52.series-api:proxy-dao:[unknown-version], /var/lib/jenkins/workspace/sos-proxy-dev/proxy-dao/pom.xml, line 311, column 21
[WARNING] 'dependencies.dependency.(groupId:artifactId:type:classifier)' must be unique: junit:junit:jar -> duplicate declaration of version (?) @ org.n52.series-api:proxy-dao:[unknown-version], /var/lib/jenkins/workspace/sos-proxy-dev/proxy-dao/pom.xml, line 331, column 21
[WARNING] 'dependencies.dependency.(groupId:artifactId:type:classifier)' must be unique: org.springframework:spring-test:jar -> duplicate declaration of version (?) @ org.n52.series-api:proxy-dao:[unknown-version], /var/lib/jenkins/workspace/sos-proxy-dev/proxy-dao/pom.xml, line 346, column 21
[WARNING] 
[WARNING] It is highly recommended to fix these problems because they threaten the stability of your build.
[WARNING] 
[WARNING] For this reason, future Maven versions might no longer support building such malformed projects.
[WARNING] 
[INFO] ------------------------------------------------------------------------
[INFO] Reactor Build Order:
[INFO] 
[INFO] Series REST API - SOS Proxy                                        [pom]
[INFO] Series REST API - SOS Proxy Dao Module                             [jar]
[INFO] Series REST API - SOS Proxy App Module                             [jar]
[INFO] Series REST API - SOS Proxy Webapp                                 [war]
[INFO] 
[INFO] ----------------< org.n52.series-api:series-sos-proxy >-----------------
[INFO] Building Series REST API - SOS Proxy 2.0.0-SNAPSHOT                [1/4]
[INFO] --------------------------------[ pom ]---------------------------------
[INFO] 
[INFO] --- maven-clean-plugin:3.1.0:clean (default-clean) @ series-sos-proxy ---
[INFO] 
[INFO] --- git-commit-id-plugin:2.2.1:revision (default) @ series-sos-proxy ---
[INFO] 
[INFO] --- maven-enforcer-plugin:3.0.0-M3:enforce (default) @ series-sos-proxy ---
[INFO] 
[INFO] --- whitespace-maven-plugin:1.0.4:trim (default) @ series-sos-proxy ---
[INFO] 
[INFO] >>> maven-source-plugin:3.2.1:jar (default) > generate-sources @ series-sos-proxy >>>
[INFO] 
[INFO] --- git-commit-id-plugin:2.2.1:revision (default) @ series-sos-proxy ---
[INFO] 
[INFO] --- maven-enforcer-plugin:3.0.0-M3:enforce (default) @ series-sos-proxy ---
[WARNING] Failed to getClass for org.apache.maven.plugins.source.SourceJarMojo
[INFO] 
[INFO] <<< maven-source-plugin:3.2.1:jar (default) < generate-sources @ series-sos-proxy <<<
[INFO] 
[INFO] 
[INFO] --- maven-source-plugin:3.2.1:jar (default) @ series-sos-proxy ---
[INFO] 
[INFO] --- maven-javadoc-plugin:3.1.1:jar (default) @ series-sos-proxy ---
[INFO] Not executing Javadoc as the project is not a Java classpath-capable package
[INFO] 
[INFO] --- maven-dependency-plugin:3.1.1:analyze-only (analyze-dependencies) @ series-sos-proxy ---
[INFO] Skipping pom project
[INFO] 
[INFO] --- maven-install-plugin:3.0.0-M1:install (default-install) @ series-sos-proxy ---
[INFO] Installing /var/lib/jenkins/workspace/sos-proxy-dev/pom.xml to /var/lib/jenkins/.m2/repository/org/n52/series-api/series-sos-proxy/2.0.0-SNAPSHOT/series-sos-proxy-2.0.0-SNAPSHOT.pom
[INFO] 
[INFO] --- maven-dependency-plugin:3.1.1:resolve (download-sources) @ series-sos-proxy ---
[INFO] 
[INFO] --- maven-dependency-plugin:3.1.1:resolve (download-javadoc) @ series-sos-proxy ---
[INFO] 
[INFO] --------------------< org.n52.series-api:proxy-dao >--------------------
[INFO] Building Series REST API - SOS Proxy Dao Module 2.0.0-SNAPSHOT     [2/4]
[INFO] --------------------------------[ jar ]---------------------------------
[INFO] Downloading from 52n-nexus: http://localhost/nexus/content/groups/public/org/n52/series-api/io/2.0.1-SNAPSHOT/maven-metadata.xml
[INFO] Downloaded from 52n-nexus: http://localhost/nexus/content/groups/public/org/n52/series-api/io/2.0.1-SNAPSHOT/maven-metadata.xml (1.2 kB at 421 B/s)
[INFO] Downloading from 52n-nexus: http://localhost/nexus/content/groups/public/org/n52/series-api/series-rest-api/2.0.1-SNAPSHOT/maven-metadata.xml
[INFO] Downloaded from 52n-nexus: http://localhost/nexus/content/groups/public/org/n52/series-api/series-rest-api/2.0.1-SNAPSHOT/maven-metadata.xml (614 B at 5.3 kB/s)
[INFO] Downloading from 52n-nexus: http://localhost/nexus/content/groups/public/org/n52/series-api/spi/2.0.1-SNAPSHOT/maven-metadata.xml
[INFO] Downloaded from 52n-nexus: http://localhost/nexus/content/groups/public/org/n52/series-api/spi/2.0.1-SNAPSHOT/maven-metadata.xml (1.2 kB at 4.8 kB/s)
[INFO] Downloading from 52n-nexus: http://localhost/nexus/content/groups/public/org/n52/arctic-sea/shetland/7.2.0-SNAPSHOT/maven-metadata.xml
[INFO] Downloaded from 52n-nexus: http://localhost/nexus/content/groups/public/org/n52/arctic-sea/shetland/7.2.0-SNAPSHOT/maven-metadata.xml (1.4 kB at 6.8 kB/s)
[INFO] Downloading from 52n-nexus: http://localhost/nexus/content/groups/public/org/n52/arctic-sea/shetland-parent/7.2.0-SNAPSHOT/maven-metadata.xml
[INFO] Downloaded from 52n-nexus: http://localhost/nexus/content/groups/public/org/n52/arctic-sea/shetland-parent/7.2.0-SNAPSHOT/maven-metadata.xml (612 B at 4.7 kB/s)
[INFO] Downloading from 52n-nexus: http://localhost/nexus/content/groups/public/org/n52/arctic-sea/arctic-sea/7.2.0-SNAPSHOT/maven-metadata.xml
[INFO] Downloaded from 52n-nexus: http://localhost/nexus/content/groups/public/org/n52/arctic-sea/arctic-sea/7.2.0-SNAPSHOT/maven-metadata.xml (607 B at 6.5 kB/s)
[INFO] Downloading from 52n-nexus: http://localhost/nexus/content/groups/public/org/n52/arctic-sea/janmayen/7.2.0-SNAPSHOT/maven-metadata.xml
[INFO] Downloaded from 52n-nexus: http://localhost/nexus/content/groups/public/org/n52/arctic-sea/janmayen/7.2.0-SNAPSHOT/maven-metadata.xml (1.2 kB at 16 kB/s)
[INFO] Downloading from 52n-nexus: http://localhost/nexus/content/groups/public/org/n52/arctic-sea/faroe-annotations/7.2.0-SNAPSHOT/maven-metadata.xml
[INFO] Downloaded from 52n-nexus: http://localhost/nexus/content/groups/public/org/n52/arctic-sea/faroe-annotations/7.2.0-SNAPSHOT/maven-metadata.xml (1.2 kB at 17 kB/s)
[INFO] Downloading from 52n-nexus: http://localhost/nexus/content/groups/public/org/n52/arctic-sea/faroe-parent/7.2.0-SNAPSHOT/maven-metadata.xml
[INFO] Downloaded from 52n-nexus: http://localhost/nexus/content/groups/public/org/n52/arctic-sea/faroe-parent/7.2.0-SNAPSHOT/maven-metadata.xml (609 B at 5.6 kB/s)
[INFO] Downloading from 52n-nexus: http://localhost/nexus/content/groups/public/org/n52/arctic-sea/svalbard/7.2.0-SNAPSHOT/maven-metadata.xml
[INFO] Downloaded from 52n-nexus: http://localhost/nexus/content/groups/public/org/n52/arctic-sea/svalbard/7.2.0-SNAPSHOT/maven-metadata.xml (1.4 kB at 472 B/s)
[INFO] Downloading from 52n-nexus: http://localhost/nexus/content/groups/public/org/n52/arctic-sea/svalbard-parent/7.2.0-SNAPSHOT/maven-metadata.xml
[INFO] Downloaded from 52n-nexus: http://localhost/nexus/content/groups/public/org/n52/arctic-sea/svalbard-parent/7.2.0-SNAPSHOT/maven-metadata.xml (612 B at 1.1 kB/s)
[INFO] Downloading from 52n-nexus: http://localhost/nexus/content/groups/public/org/n52/arctic-sea/faroe-utils/7.2.0-SNAPSHOT/maven-metadata.xml
[INFO] Downloaded from 52n-nexus: http://localhost/nexus/content/groups/public/org/n52/arctic-sea/faroe-utils/7.2.0-SNAPSHOT/maven-metadata.xml (1.2 kB at 2.6 kB/s)
[INFO] Downloading from 52n-nexus: http://localhost/nexus/content/groups/public/org/n52/series-api/xml-pdf-format/2.0.1-SNAPSHOT/maven-metadata.xml
[INFO] Downloaded from 52n-nexus: http://localhost/nexus/content/groups/public/org/n52/series-api/xml-pdf-format/2.0.1-SNAPSHOT/maven-metadata.xml (1.2 kB at 310 B/s)
[INFO] Downloading from 52n-nexus: http://localhost/nexus/content/groups/public/org/n52/series-api/db/dao/4.0.0-SNAPSHOT/maven-metadata.xml
[INFO] Downloaded from 52n-nexus: http://localhost/nexus/content/groups/public/org/n52/series-api/db/dao/4.0.0-SNAPSHOT/maven-metadata.xml (1.4 kB at 3.2 kB/s)
[INFO] Downloading from 52n-nexus: http://localhost/nexus/content/groups/public/org/n52/series-api/db/series-dao/4.0.0-SNAPSHOT/maven-metadata.xml
[INFO] Downloaded from 52n-nexus: http://localhost/nexus/content/groups/public/org/n52/series-api/db/series-dao/4.0.0-SNAPSHOT/maven-metadata.xml (823 B at 1.8 kB/s)
[INFO] Downloading from 52n-nexus: http://localhost/nexus/content/groups/public/org/n52/series/db/entities/2.0.0-SNAPSHOT/maven-metadata.xml
[INFO] Downloaded from 52n-nexus: http://localhost/nexus/content/groups/public/org/n52/series/db/entities/2.0.0-SNAPSHOT/maven-metadata.xml (1.4 kB at 235 B/s)
[INFO] Downloading from 52n-nexus: http://localhost/nexus/content/groups/public/org/n52/series/db/parent/2.0.0-SNAPSHOT/maven-metadata.xml
[INFO] Downloaded from 52n-nexus: http://localhost/nexus/content/groups/public/org/n52/series/db/parent/2.0.0-SNAPSHOT/maven-metadata.xml (818 B at 1.8 kB/s)
[INFO] Downloading from 52n-nexus: http://localhost/nexus/content/groups/public/org/n52/series/db/types/2.0.0-SNAPSHOT/maven-metadata.xml
[INFO] Downloaded from 52n-nexus: http://localhost/nexus/content/groups/public/org/n52/series/db/types/2.0.0-SNAPSHOT/maven-metadata.xml (1.4 kB at 3.2 kB/s)
[INFO] Downloading from 52n-nexus: http://localhost/nexus/content/groups/public/org/n52/arctic-sea/svalbard-xmlbeans/7.2.0-SNAPSHOT/maven-metadata.xml
[INFO] Downloaded from 52n-nexus: http://localhost/nexus/content/groups/public/org/n52/arctic-sea/svalbard-xmlbeans/7.2.0-SNAPSHOT/maven-metadata.xml (1.2 kB at 2.7 kB/s)
[INFO] Downloading from 52n-nexus: http://localhost/nexus/content/groups/public/org/n52/arctic-sea/svalbard-xmlstream/7.2.0-SNAPSHOT/maven-metadata.xml
[INFO] Downloaded from 52n-nexus: http://localhost/nexus/content/groups/public/org/n52/arctic-sea/svalbard-xmlstream/7.2.0-SNAPSHOT/maven-metadata.xml (1.2 kB at 2.6 kB/s)
[INFO] Downloading from 52n-nexus: http://localhost/nexus/content/groups/public/org/n52/arctic-sea/shetland-rdf/7.2.0-SNAPSHOT/maven-metadata.xml
[INFO] Downloaded from 52n-nexus: http://localhost/nexus/content/groups/public/org/n52/arctic-sea/shetland-rdf/7.2.0-SNAPSHOT/maven-metadata.xml (1.4 kB at 2.8 kB/s)
[INFO] Downloading from 52n-nexus: http://localhost/nexus/content/groups/public/org/n52/arctic-sea/iceland/7.2.0-SNAPSHOT/maven-metadata.xml
[INFO] Downloaded from 52n-nexus: http://localhost/nexus/content/groups/public/org/n52/arctic-sea/iceland/7.2.0-SNAPSHOT/maven-metadata.xml (1.4 kB at 3.2 kB/s)
[INFO] Downloading from 52n-nexus: http://localhost/nexus/content/groups/public/org/n52/arctic-sea/iceland-parent/7.2.0-SNAPSHOT/maven-metadata.xml
[INFO] Downloaded from 52n-nexus: http://localhost/nexus/content/groups/public/org/n52/arctic-sea/iceland-parent/7.2.0-SNAPSHOT/maven-metadata.xml (611 B at 1.3 kB/s)
[INFO] Downloading from 52n-nexus: http://localhost/nexus/content/groups/public/org/n52/arctic-sea/faroe/7.2.0-SNAPSHOT/maven-metadata.xml
[INFO] Downloaded from 52n-nexus: http://localhost/nexus/content/groups/public/org/n52/arctic-sea/faroe/7.2.0-SNAPSHOT/maven-metadata.xml (1.4 kB at 334 B/s)
[INFO] Downloading from 52n-nexus: http://localhost/nexus/content/groups/public/org/n52/arctic-sea/faroe-json/7.2.0-SNAPSHOT/maven-metadata.xml
[INFO] Downloaded from 52n-nexus: http://localhost/nexus/content/groups/public/org/n52/arctic-sea/faroe-json/7.2.0-SNAPSHOT/maven-metadata.xml (1.2 kB at 2.4 kB/s)
[INFO] Downloading from 52n-nexus: http://localhost/nexus/content/groups/public/com/google/code/gson/gson/2.8.6/gson-2.8.6.pom
[INFO] Downloaded from 52n-nexus: http://localhost/nexus/content/groups/public/com/google/code/gson/gson/2.8.6/gson-2.8.6.pom (2.5 kB at 2.9 kB/s)
[INFO] Downloading from 52n-nexus: http://localhost/nexus/content/groups/public/com/google/code/gson/gson-parent/2.8.6/gson-parent-2.8.6.pom
[INFO] Downloaded from 52n-nexus: http://localhost/nexus/content/groups/public/com/google/code/gson/gson-parent/2.8.6/gson-parent-2.8.6.pom (4.4 kB at 23 kB/s)
[INFO] Downloading from 52n-nexus: http://localhost/nexus/content/groups/public/org/n52/series/db/mappings/2.0.0-SNAPSHOT/maven-metadata.xml
[INFO] Downloaded from 52n-nexus: http://localhost/nexus/content/groups/public/org/n52/series/db/mappings/2.0.0-SNAPSHOT/maven-metadata.xml (1.4 kB at 2.0 kB/s)
[INFO] Downloading from 52n-nexus: http://localhost/nexus/content/groups/public/com/google/code/gson/gson/2.8.6/gson-2.8.6.jar
[INFO] Downloaded from 52n-nexus: http://localhost/nexus/content/groups/public/com/google/code/gson/gson/2.8.6/gson-2.8.6.jar (240 kB at 358 kB/s)
[INFO] 
[INFO] --- maven-clean-plugin:3.1.0:clean (default-clean) @ proxy-dao ---
[INFO] 
[INFO] --- git-commit-id-plugin:2.2.1:revision (default) @ proxy-dao ---
[INFO] 
[INFO] --- maven-enforcer-plugin:3.0.0-M3:enforce (default) @ proxy-dao ---
[WARNING] 
Dependency convergence error for javax.activation:activation:1.1.1 paths to dependency are:
+-org.n52.series-api:proxy-dao:2.0.0-SNAPSHOT
  +-org.n52.arctic-sea:iceland:7.2.0-20191108.114313-58
    +-com.siemens.ct.exi:exificient:1.0.4
      +-javax.activation:activation:1.1.1
and
+-org.n52.series-api:proxy-dao:2.0.0-SNAPSHOT
  +-org.geotools:gt-referencing:22.2
    +-jgridshift:jgridshift-core:1.2
      +-javax:javaee-api:7.0
        +-com.sun.mail:javax.mail:1.5.0
          +-javax.activation:activation:1.1

[WARNING] 
Dependency convergence error for org.n52.arctic-sea:svalbard-odata:7.1.0 paths to dependency are:
+-org.n52.series-api:proxy-dao:2.0.0-SNAPSHOT
  +-org.n52.series-api.db:dao:4.0.0-20191106.170139-13
    +-org.n52.arctic-sea:svalbard-odata:7.1.0
and
+-org.n52.series-api:proxy-dao:2.0.0-SNAPSHOT
  +-org.n52.series-api:spi:2.0.1-20200217.081101-581
    +-org.n52.arctic-sea:svalbard-odata:7.3.0

[WARNING] Rule 1: org.apache.maven.plugins.enforcer.DependencyConvergence failed with message:
Failed while enforcing releasability. See above detailed error message.
[INFO] ------------------------------------------------------------------------
[INFO] Reactor Summary for Series REST API - SOS Proxy 2.0.0-SNAPSHOT:
[INFO] 
[INFO] Series REST API - SOS Proxy ........................ SUCCESS [  2.481 s]
[INFO] Series REST API - SOS Proxy Dao Module ............. FAILURE [ 43.058 s]
[INFO] Series REST API - SOS Proxy App Module ............. SKIPPED
[INFO] Series REST API - SOS Proxy Webapp ................. SKIPPED
[INFO] ------------------------------------------------------------------------
[INFO] BUILD FAILURE
[INFO] ------------------------------------------------------------------------
[INFO] Total time:  47.528 s
[INFO] Finished at: 2020-03-10T07:32:02Z
[INFO] ------------------------------------------------------------------------
Waiting for Jenkins to finish collecting data
[ERROR] Failed to execute goal org.apache.maven.plugins:maven-enforcer-plugin:3.0.0-M3:enforce (default) on project proxy-dao: Some Enforcer rules have failed. Look above for specific messages explaining why the rule failed. -> [Help 1]
[ERROR] 
[ERROR] To see the full stack trace of the errors, re-run Maven with the -e switch.
[ERROR] Re-run Maven using the -X switch to enable full debug logging.
[ERROR] 
[ERROR] For more information about the errors and possible solutions, please read the following articles:
[ERROR] [Help 1] http://cwiki.apache.org/confluence/display/MAVEN/MojoExecutionException
[ERROR] 
[ERROR] After correcting the problems, you can resume the build with the command
[ERROR]   mvn <goals> -rf :proxy-dao
[JENKINS] Archiving /var/lib/jenkins/workspace/sos-proxy-dev/pom.xml to org.n52.series-api/series-sos-proxy/2.0.0-SNAPSHOT/series-sos-proxy-2.0.0-SNAPSHOT.pom
[JENKINS] Archiving /var/lib/jenkins/workspace/sos-proxy-dev/proxy-webapp/pom.xml to org.n52.series-api/proxy-webapp/2.0.0-SNAPSHOT/proxy-webapp-2.0.0-SNAPSHOT.pom
[JENKINS] Archiving /var/lib/jenkins/workspace/sos-proxy-dev/proxy-dao/pom.xml to org.n52.series-api/proxy-dao/2.0.0-SNAPSHOT/proxy-dao-2.0.0-SNAPSHOT.pom
[JENKINS] Archiving /var/lib/jenkins/workspace/sos-proxy-dev/proxy-app/pom.xml to org.n52.series-api/proxy-app/2.0.0-SNAPSHOT/proxy-app-2.0.0-SNAPSHOT.pom
No mail will be sent out, as 'sos-proxy-dev » Series REST API - SOS Proxy Webapp #982' does not have a result yet. Please make sure you set a proper result in case of pipeline/build scripts.
Sending e-mails to: sensorweb-commits@52north.org
No mail will be sent out, as 'sos-proxy-dev » Series REST API - SOS Proxy App Module #982' does not have a result yet. Please make sure you set a proper result in case of pipeline/build scripts.
channel stopped
Sending e-mails to: sensorweb-commits@52north.org
Finished: FAILURE