Console Output

Started by timer
Running as SYSTEM
Building in workspace /var/lib/jenkins/workspace/sos-proxy-dev
No credentials specified
 > git rev-parse --is-inside-work-tree # timeout=10
Fetching changes from the remote Git repository
 > git config remote.origin.url https://github.com/52North/series-sos-proxy # timeout=10
Fetching upstream changes from https://github.com/52North/series-sos-proxy
 > git --version # timeout=10
 > git fetch --tags --progress -- https://github.com/52North/series-sos-proxy +refs/heads/*:refs/remotes/origin/* # timeout=10
 > git rev-parse refs/remotes/origin/develop^{commit} # timeout=10
 > git rev-parse refs/remotes/origin/origin/develop^{commit} # timeout=10
Checking out Revision f6af7ec962041d8461119fa7a3a7e94561cd6751 (refs/remotes/origin/develop)
 > git config core.sparsecheckout # timeout=10
 > git checkout -f f6af7ec962041d8461119fa7a3a7e94561cd6751 # timeout=10
Commit message: "Merge pull request #36 from 52North/dependabot/maven/org.springframework.boot-spring-boot-dependencies-2.2.5.RELEASE"
 > git rev-list --no-walk f6af7ec962041d8461119fa7a3a7e94561cd6751 # timeout=10
 > git tag -a -f -m Jenkins Build #981 jenkins-sos-proxy-dev-981 # timeout=10
Parsing POMs
Modules changed, recalculating dependency graph
Established TCP socket on 37681
[sos-proxy-dev] $ /var/lib/jenkins/tools/hudson.model.JDK/Java-1.8/bin/java -Xmx1024m -XX:MaxPermSize=1024m -cp /var/lib/jenkins/plugins/maven-plugin/WEB-INF/lib/maven35-agent-1.13.jar:/var/lib/jenkins/tools/hudson.tasks.Maven_MavenInstallation/Maven_3.x/boot/plexus-classworlds-2.5.2.jar:/var/lib/jenkins/tools/hudson.tasks.Maven_MavenInstallation/Maven_3.x/conf/logging jenkins.maven3.agent.Maven35Main /var/lib/jenkins/tools/hudson.tasks.Maven_MavenInstallation/Maven_3.x /var/cache/jenkins/war/WEB-INF/lib/remoting-4.2.jar /var/lib/jenkins/plugins/maven-plugin/WEB-INF/lib/maven35-interceptor-1.13.jar /var/lib/jenkins/plugins/maven-plugin/WEB-INF/lib/maven3-interceptor-commons-1.13.jar 37681
Java HotSpot(TM) 64-Bit Server VM warning: ignoring option MaxPermSize=1024m; support was removed in 8.0
<===[JENKINS REMOTING CAPACITY]===>channel started
Executing Maven:  -B -f /var/lib/jenkins/workspace/sos-proxy-dev/pom.xml clean install -Denv=ci
[INFO] Scanning for projects...
[WARNING] 
[WARNING] Some problems were encountered while building the effective model for org.n52.series-api:proxy-dao:jar:2.0.0-SNAPSHOT
[WARNING] 'dependencies.dependency.(groupId:artifactId:type:classifier)' must be unique: ch.qos.logback:logback-classic:jar -> duplicate declaration of version (?) @ org.n52.series-api:proxy-dao:[unknown-version], /var/lib/jenkins/workspace/sos-proxy-dev/proxy-dao/pom.xml, line 311, column 21
[WARNING] 'dependencies.dependency.(groupId:artifactId:type:classifier)' must be unique: junit:junit:jar -> duplicate declaration of version (?) @ org.n52.series-api:proxy-dao:[unknown-version], /var/lib/jenkins/workspace/sos-proxy-dev/proxy-dao/pom.xml, line 331, column 21
[WARNING] 'dependencies.dependency.(groupId:artifactId:type:classifier)' must be unique: org.springframework:spring-test:jar -> duplicate declaration of version (?) @ org.n52.series-api:proxy-dao:[unknown-version], /var/lib/jenkins/workspace/sos-proxy-dev/proxy-dao/pom.xml, line 346, column 21
[WARNING] 
[WARNING] It is highly recommended to fix these problems because they threaten the stability of your build.
[WARNING] 
[WARNING] For this reason, future Maven versions might no longer support building such malformed projects.
[WARNING] 
[INFO] ------------------------------------------------------------------------
[INFO] Reactor Build Order:
[INFO] 
[INFO] Series REST API - SOS Proxy                                        [pom]
[INFO] Series REST API - SOS Proxy Dao Module                             [jar]
[INFO] Series REST API - SOS Proxy App Module                             [jar]
[INFO] Series REST API - SOS Proxy Webapp                                 [war]
[INFO] 
[INFO] ----------------< org.n52.series-api:series-sos-proxy >-----------------
[INFO] Building Series REST API - SOS Proxy 2.0.0-SNAPSHOT                [1/4]
[INFO] --------------------------------[ pom ]---------------------------------
[INFO] 
[INFO] --- maven-clean-plugin:3.1.0:clean (default-clean) @ series-sos-proxy ---
[INFO] 
[INFO] --- git-commit-id-plugin:2.2.1:revision (default) @ series-sos-proxy ---
[INFO] 
[INFO] --- maven-enforcer-plugin:3.0.0-M1:enforce (default) @ series-sos-proxy ---
[INFO] 
[INFO] --- whitespace-maven-plugin:1.0.4:trim (default) @ series-sos-proxy ---
[INFO] 
[INFO] >>> maven-source-plugin:3.0.1:jar (default) > generate-sources @ series-sos-proxy >>>
[INFO] 
[INFO] --- git-commit-id-plugin:2.2.1:revision (default) @ series-sos-proxy ---
[INFO] 
[INFO] --- maven-enforcer-plugin:3.0.0-M1:enforce (default) @ series-sos-proxy ---
[WARNING] Failed to getClass for org.apache.maven.plugins.source.SourceJarMojo
[INFO] 
[INFO] <<< maven-source-plugin:3.0.1:jar (default) < generate-sources @ series-sos-proxy <<<
[INFO] 
[INFO] 
[INFO] --- maven-source-plugin:3.0.1:jar (default) @ series-sos-proxy ---
[INFO] 
[INFO] --- maven-javadoc-plugin:3.0.1:jar (default) @ series-sos-proxy ---
[INFO] Not executing Javadoc as the project is not a Java classpath-capable package
[INFO] 
[INFO] --- maven-dependency-plugin:3.1.1:analyze-only (analyze-dependencies) @ series-sos-proxy ---
[INFO] Skipping pom project
[INFO] 
[INFO] --- maven-install-plugin:3.0.0-M1:install (default-install) @ series-sos-proxy ---
[INFO] Installing /var/lib/jenkins/workspace/sos-proxy-dev/pom.xml to /var/lib/jenkins/.m2/repository/org/n52/series-api/series-sos-proxy/2.0.0-SNAPSHOT/series-sos-proxy-2.0.0-SNAPSHOT.pom
[INFO] 
[INFO] --- maven-dependency-plugin:3.1.1:resolve (download-sources) @ series-sos-proxy ---
[INFO] 
[INFO] --- maven-dependency-plugin:3.1.1:resolve (download-javadoc) @ series-sos-proxy ---
[INFO] 
[INFO] --------------------< org.n52.series-api:proxy-dao >--------------------
[INFO] Building Series REST API - SOS Proxy Dao Module 2.0.0-SNAPSHOT     [2/4]
[INFO] --------------------------------[ jar ]---------------------------------
[INFO] 
[INFO] --- maven-clean-plugin:3.1.0:clean (default-clean) @ proxy-dao ---
[INFO] 
[INFO] --- git-commit-id-plugin:2.2.1:revision (default) @ proxy-dao ---
[INFO] 
[INFO] --- maven-enforcer-plugin:3.0.0-M1:enforce (default) @ proxy-dao ---
[WARNING] 
Dependency convergence error for org.n52.arctic-sea:svalbard-odata:7.1.0 paths to dependency are:
+-org.n52.series-api:proxy-dao:2.0.0-SNAPSHOT
  +-org.n52.series-api.db:dao:4.0.0-20191106.170139-13
    +-org.n52.arctic-sea:svalbard-odata:7.1.0
and
+-org.n52.series-api:proxy-dao:2.0.0-SNAPSHOT
  +-org.n52.series-api:spi:2.0.1-20200217.081101-581
    +-org.n52.arctic-sea:svalbard-odata:7.3.0

[WARNING] Rule 1: org.apache.maven.plugins.enforcer.DependencyConvergence failed with message:
Failed while enforcing releasability. See above detailed error message.
[INFO] ------------------------------------------------------------------------
[INFO] Reactor Summary for Series REST API - SOS Proxy 2.0.0-SNAPSHOT:
[INFO] 
[INFO] Series REST API - SOS Proxy ........................ SUCCESS [  1.903 s]
[INFO] Series REST API - SOS Proxy Dao Module ............. FAILURE [  3.626 s]
[INFO] Series REST API - SOS Proxy App Module ............. SKIPPED
[INFO] Series REST API - SOS Proxy Webapp ................. SKIPPED
[INFO] ------------------------------------------------------------------------
[INFO] BUILD FAILURE
[INFO] ------------------------------------------------------------------------
[INFO] Total time:  7.006 s
[INFO] Finished at: 2020-03-09T20:01:10Z
[INFO] ------------------------------------------------------------------------
Waiting for Jenkins to finish collecting data
[ERROR] Failed to execute goal org.apache.maven.plugins:maven-enforcer-plugin:3.0.0-M1:enforce (default) on project proxy-dao: Some Enforcer rules have failed. Look above for specific messages explaining why the rule failed. -> [Help 1]
[ERROR] 
[ERROR] To see the full stack trace of the errors, re-run Maven with the -e switch.
[ERROR] Re-run Maven using the -X switch to enable full debug logging.
[ERROR] 
[ERROR] For more information about the errors and possible solutions, please read the following articles:
[ERROR] [Help 1] http://cwiki.apache.org/confluence/display/MAVEN/MojoExecutionException
[ERROR] 
[ERROR] After correcting the problems, you can resume the build with the command
[ERROR]   mvn <goals> -rf :proxy-dao
[JENKINS] Archiving /var/lib/jenkins/workspace/sos-proxy-dev/pom.xml to org.n52.series-api/series-sos-proxy/2.0.0-SNAPSHOT/series-sos-proxy-2.0.0-SNAPSHOT.pom
[JENKINS] Archiving /var/lib/jenkins/workspace/sos-proxy-dev/proxy-webapp/pom.xml to org.n52.series-api/proxy-webapp/2.0.0-SNAPSHOT/proxy-webapp-2.0.0-SNAPSHOT.pom
[JENKINS] Archiving /var/lib/jenkins/workspace/sos-proxy-dev/proxy-dao/pom.xml to org.n52.series-api/proxy-dao/2.0.0-SNAPSHOT/proxy-dao-2.0.0-SNAPSHOT.pom
[JENKINS] Archiving /var/lib/jenkins/workspace/sos-proxy-dev/proxy-app/pom.xml to org.n52.series-api/proxy-app/2.0.0-SNAPSHOT/proxy-app-2.0.0-SNAPSHOT.pom
No mail will be sent out, as 'sos-proxy-dev » Series REST API - SOS Proxy Webapp #981' does not have a result yet. Please make sure you set a proper result in case of pipeline/build scripts.
Sending e-mails to: sensorweb-commits@52north.org
No mail will be sent out, as 'sos-proxy-dev » Series REST API - SOS Proxy App Module #981' does not have a result yet. Please make sure you set a proper result in case of pipeline/build scripts.
channel stopped
Sending e-mails to: sensorweb-commits@52north.org
Finished: FAILURE