Console Output

Skipping 1,451 KB.. Full Log
[INFO] Uploading: dav:https://52north.org/maven/repo/releases/org/n52/sensorweb/sos/do-json/maven-metadata.xml
[INFO] basic authentication scheme selected
[INFO] basic authentication scheme selected
[INFO] basic authentication scheme selected
[INFO] basic authentication scheme selected
[INFO] basic authentication scheme selected
[INFO] basic authentication scheme selected
[INFO] Uploaded: dav:https://52north.org/maven/repo/releases/org/n52/sensorweb/sos/do-json/maven-metadata.xml (3 KB at 77.9 KB/sec)
[INFO] Uploading: dav:https://52north.org/maven/repo/releases/org/n52/sensorweb/sos/do-json/4.3.11-UBA-1.0.1/do-json-4.3.11-UBA-1.0.1-sources.jar
[INFO] basic authentication scheme selected
[INFO] basic authentication scheme selected
[INFO] basic authentication scheme selected
[INFO] basic authentication scheme selected
[INFO] basic authentication scheme selected
[INFO] basic authentication scheme selected
[INFO] Uploaded: dav:https://52north.org/maven/repo/releases/org/n52/sensorweb/sos/do-json/4.3.11-UBA-1.0.1/do-json-4.3.11-UBA-1.0.1-sources.jar (8 KB at 210.3 KB/sec)
[INFO] Uploading: dav:https://52north.org/maven/repo/releases/org/n52/sensorweb/sos/do-json/4.3.11-UBA-1.0.1/do-json-4.3.11-UBA-1.0.1-sources.jar
[INFO] basic authentication scheme selected
[INFO] basic authentication scheme selected
[INFO] basic authentication scheme selected
[INFO] basic authentication scheme selected
[INFO] basic authentication scheme selected
[INFO] basic authentication scheme selected
[INFO] Uploaded: dav:https://52north.org/maven/repo/releases/org/n52/sensorweb/sos/do-json/4.3.11-UBA-1.0.1/do-json-4.3.11-UBA-1.0.1-sources.jar (8 KB at 235.0 KB/sec)
[INFO]                                                                         
[INFO] ------------------------------------------------------------------------
[INFO] Building 52°North SOS - SOS 2.0 Inspire extension 4.3.11-UBA-1.0.1
[INFO] ------------------------------------------------------------------------
[INFO] 
[INFO] --- maven-clean-plugin:2.5:clean (default-clean) @ inspire ---
[INFO] 
[INFO] --- git-commit-id-plugin:2.1.9:revision (git-commit-id) @ inspire ---
[INFO] 
[INFO] --- gmaven-plugin:1.0:execute (default) @ inspire ---
[INFO] 
[INFO] --- maven-site-plugin:2.3:attach-descriptor (attach-descriptor) @ inspire ---
[INFO] 
[INFO] >>> maven-source-plugin:2.3:jar (attach-sources) > generate-sources @ inspire >>>
[INFO] 
[INFO] --- git-commit-id-plugin:2.1.9:revision (git-commit-id) @ inspire ---
[INFO] 
[INFO] --- gmaven-plugin:1.0:execute (default) @ inspire ---
[WARNING] Failed to getClass for org.apache.maven.plugin.source.SourceJarMojo
[INFO] 
[INFO] <<< maven-source-plugin:2.3:jar (attach-sources) < generate-sources @ inspire <<<
[INFO] 
[INFO] --- maven-source-plugin:2.3:jar (attach-sources) @ inspire ---
[INFO] 
[INFO] --- maven-install-plugin:2.4:install (default-install) @ inspire ---
[INFO] Installing /var/lib/jenkins/workspace/deploy_SOS-UBA-mergable-series/extensions/inspire/pom.xml to /var/lib/jenkins/.m2/repository/org/n52/sensorweb/sos/inspire/4.3.11-UBA-1.0.1/inspire-4.3.11-UBA-1.0.1.pom
[INFO] 
[INFO] --- git-commit-id-plugin:2.1.9:revision (git-commit-id) @ inspire ---
[INFO] 
[INFO] --- gmaven-plugin:1.0:execute (default) @ inspire ---
[INFO] 
[INFO] --- maven-site-plugin:2.3:attach-descriptor (attach-descriptor) @ inspire ---
[INFO] 
[INFO] >>> maven-source-plugin:2.3:jar (attach-sources) > generate-sources @ inspire >>>
[INFO] 
[INFO] --- git-commit-id-plugin:2.1.9:revision (git-commit-id) @ inspire ---
[INFO] 
[INFO] --- gmaven-plugin:1.0:execute (default) @ inspire ---
[WARNING] Failed to getClass for org.apache.maven.plugin.source.SourceJarMojo
[INFO] 
[INFO] <<< maven-source-plugin:2.3:jar (attach-sources) < generate-sources @ inspire <<<
[INFO] 
[INFO] --- maven-source-plugin:2.3:jar (attach-sources) @ inspire ---
[INFO] 
[INFO] --- maven-install-plugin:2.4:install (default-install) @ inspire ---
[INFO] Installing /var/lib/jenkins/workspace/deploy_SOS-UBA-mergable-series/extensions/inspire/pom.xml to /var/lib/jenkins/.m2/repository/org/n52/sensorweb/sos/inspire/4.3.11-UBA-1.0.1/inspire-4.3.11-UBA-1.0.1.pom
[INFO] 
[INFO] --- maven-deploy-plugin:2.7:deploy (default-deploy) @ inspire ---
[INFO] Uploading: dav:https://52north.org/maven/repo/releases/org/n52/sensorweb/sos/inspire/4.3.11-UBA-1.0.1/inspire-4.3.11-UBA-1.0.1.pom
[INFO] basic authentication scheme selected
[INFO] basic authentication scheme selected
[INFO] basic authentication scheme selected
[INFO] basic authentication scheme selected
[INFO] basic authentication scheme selected
[INFO] basic authentication scheme selected
[INFO] Uploaded: dav:https://52north.org/maven/repo/releases/org/n52/sensorweb/sos/inspire/4.3.11-UBA-1.0.1/inspire-4.3.11-UBA-1.0.1.pom (6 KB at 139.8 KB/sec)
[INFO] Downloading: dav:https://52north.org/maven/repo/releases/org/n52/sensorweb/sos/inspire/maven-metadata.xml
[INFO] Downloaded: dav:https://52north.org/maven/repo/releases/org/n52/sensorweb/sos/inspire/maven-metadata.xml (736 B at 27.6 KB/sec)
[INFO] Uploading: dav:https://52north.org/maven/repo/releases/org/n52/sensorweb/sos/inspire/maven-metadata.xml
[INFO] basic authentication scheme selected
[INFO] basic authentication scheme selected
[INFO] basic authentication scheme selected
[INFO] basic authentication scheme selected
[INFO] basic authentication scheme selected
[INFO] basic authentication scheme selected
[INFO] Uploaded: dav:https://52north.org/maven/repo/releases/org/n52/sensorweb/sos/inspire/maven-metadata.xml (2 KB at 49.0 KB/sec)
[INFO]                                                                         
[INFO] ------------------------------------------------------------------------
[INFO] Building 52°North SOS - Extension for Inspire - Code Module 4.3.11-UBA-1.0.1
[INFO] ------------------------------------------------------------------------
[INFO] 
[INFO] --- maven-clean-plugin:2.5:clean (default-clean) @ inspire-code ---
[INFO] Deleting /var/lib/jenkins/workspace/deploy_SOS-UBA-mergable-series/extensions/inspire/code/target
[INFO] 
[INFO] --- git-commit-id-plugin:2.1.9:revision (git-commit-id) @ inspire-code ---
[INFO] 
[INFO] --- gmaven-plugin:1.0:execute (default) @ inspire-code ---
[INFO] 
[INFO] --- maven-resources-plugin:2.6:resources (default-resources) @ inspire-code ---
[INFO] Using 'UTF-8' encoding to copy filtered resources.
[INFO] Copying 4 resources
[INFO] 
[INFO] --- maven-compiler-plugin:3.1:compile (default-compile) @ inspire-code ---
[INFO] Changes detected - recompiling the module!
[INFO] Compiling 35 source files to /var/lib/jenkins/workspace/deploy_SOS-UBA-mergable-series/extensions/inspire/code/target/classes
[WARNING] bootstrap class path not set in conjunction with -source 1.7
[INFO] 
[INFO] --- maven-resources-plugin:2.6:testResources (default-testResources) @ inspire-code ---
[INFO] Using 'UTF-8' encoding to copy filtered resources.
[INFO] skip non existing resourceDirectory /var/lib/jenkins/workspace/deploy_SOS-UBA-mergable-series/extensions/inspire/code/src/test/resources
[INFO] 
[INFO] --- maven-compiler-plugin:3.1:testCompile (default-testCompile) @ inspire-code ---
[INFO] Changes detected - recompiling the module!
[INFO] Compiling 1 source file to /var/lib/jenkins/workspace/deploy_SOS-UBA-mergable-series/extensions/inspire/code/target/test-classes
[WARNING] bootstrap class path not set in conjunction with -source 1.7
[INFO] 
[INFO] --- maven-surefire-plugin:2.16:test (default-test) @ inspire-code ---
[INFO] Surefire report directory: /var/lib/jenkins/workspace/deploy_SOS-UBA-mergable-series/extensions/inspire/code/target/surefire-reports

-------------------------------------------------------
 T E S T S
-------------------------------------------------------

Results :

Tests run: 0, Failures: 0, Errors: 0, Skipped: 0

[JENKINS] Recording test results
[INFO] 
[INFO] --- maven-jar-plugin:2.4:jar (default-jar) @ inspire-code ---
[INFO] Building jar: /var/lib/jenkins/workspace/deploy_SOS-UBA-mergable-series/extensions/inspire/code/target/inspire-code-4.3.11-UBA-1.0.1.jar
[INFO] 
[INFO] --- maven-site-plugin:2.3:attach-descriptor (attach-descriptor) @ inspire-code ---
[INFO] 
[INFO] >>> maven-source-plugin:2.3:jar (attach-sources) > generate-sources @ inspire-code >>>
[INFO] 
[INFO] --- git-commit-id-plugin:2.1.9:revision (git-commit-id) @ inspire-code ---
[INFO] 
[INFO] --- gmaven-plugin:1.0:execute (default) @ inspire-code ---
[WARNING] Failed to getClass for org.apache.maven.plugin.source.SourceJarMojo
[INFO] 
[INFO] <<< maven-source-plugin:2.3:jar (attach-sources) < generate-sources @ inspire-code <<<
[INFO] 
[INFO] --- maven-source-plugin:2.3:jar (attach-sources) @ inspire-code ---
[INFO] Building jar: /var/lib/jenkins/workspace/deploy_SOS-UBA-mergable-series/extensions/inspire/code/target/inspire-code-4.3.11-UBA-1.0.1-sources.jar
[INFO] 
[INFO] --- maven-install-plugin:2.4:install (default-install) @ inspire-code ---
[INFO] Installing /var/lib/jenkins/workspace/deploy_SOS-UBA-mergable-series/extensions/inspire/code/target/inspire-code-4.3.11-UBA-1.0.1.jar to /var/lib/jenkins/.m2/repository/org/n52/sensorweb/sos/inspire-code/4.3.11-UBA-1.0.1/inspire-code-4.3.11-UBA-1.0.1.jar
[INFO] Installing /var/lib/jenkins/workspace/deploy_SOS-UBA-mergable-series/extensions/inspire/code/pom.xml to /var/lib/jenkins/.m2/repository/org/n52/sensorweb/sos/inspire-code/4.3.11-UBA-1.0.1/inspire-code-4.3.11-UBA-1.0.1.pom
[INFO] Installing /var/lib/jenkins/workspace/deploy_SOS-UBA-mergable-series/extensions/inspire/code/target/inspire-code-4.3.11-UBA-1.0.1-sources.jar to /var/lib/jenkins/.m2/repository/org/n52/sensorweb/sos/inspire-code/4.3.11-UBA-1.0.1/inspire-code-4.3.11-UBA-1.0.1-sources.jar
[INFO] 
[INFO] --- git-commit-id-plugin:2.1.9:revision (git-commit-id) @ inspire-code ---
[INFO] 
[INFO] --- gmaven-plugin:1.0:execute (default) @ inspire-code ---
[INFO] 
[INFO] --- maven-resources-plugin:2.6:resources (default-resources) @ inspire-code ---
[INFO] Using 'UTF-8' encoding to copy filtered resources.
[INFO] Copying 4 resources
[INFO] 
[INFO] --- maven-compiler-plugin:3.1:compile (default-compile) @ inspire-code ---
[INFO] Nothing to compile - all classes are up to date
[INFO] 
[INFO] --- maven-resources-plugin:2.6:testResources (default-testResources) @ inspire-code ---
[INFO] Using 'UTF-8' encoding to copy filtered resources.
[INFO] skip non existing resourceDirectory /var/lib/jenkins/workspace/deploy_SOS-UBA-mergable-series/extensions/inspire/code/src/test/resources
[INFO] 
[INFO] --- maven-compiler-plugin:3.1:testCompile (default-testCompile) @ inspire-code ---
[INFO] Nothing to compile - all classes are up to date
[INFO] 
[INFO] --- maven-surefire-plugin:2.16:test (default-test) @ inspire-code ---
[INFO] Skipping execution of surefire because it has already been run for this configuration
[JENKINS] Recording test results
[INFO] 
[INFO] --- maven-jar-plugin:2.4:jar (default-jar) @ inspire-code ---
[INFO] 
[INFO] --- maven-site-plugin:2.3:attach-descriptor (attach-descriptor) @ inspire-code ---
[INFO] 
[INFO] >>> maven-source-plugin:2.3:jar (attach-sources) > generate-sources @ inspire-code >>>
[INFO] 
[INFO] --- git-commit-id-plugin:2.1.9:revision (git-commit-id) @ inspire-code ---
[INFO] 
[INFO] --- gmaven-plugin:1.0:execute (default) @ inspire-code ---
[WARNING] Failed to getClass for org.apache.maven.plugin.source.SourceJarMojo
[INFO] 
[INFO] <<< maven-source-plugin:2.3:jar (attach-sources) < generate-sources @ inspire-code <<<
[INFO] 
[INFO] --- maven-source-plugin:2.3:jar (attach-sources) @ inspire-code ---
[INFO] 
[INFO] --- maven-install-plugin:2.4:install (default-install) @ inspire-code ---
[INFO] Installing /var/lib/jenkins/workspace/deploy_SOS-UBA-mergable-series/extensions/inspire/code/target/inspire-code-4.3.11-UBA-1.0.1.jar to /var/lib/jenkins/.m2/repository/org/n52/sensorweb/sos/inspire-code/4.3.11-UBA-1.0.1/inspire-code-4.3.11-UBA-1.0.1.jar
[INFO] Installing /var/lib/jenkins/workspace/deploy_SOS-UBA-mergable-series/extensions/inspire/code/pom.xml to /var/lib/jenkins/.m2/repository/org/n52/sensorweb/sos/inspire-code/4.3.11-UBA-1.0.1/inspire-code-4.3.11-UBA-1.0.1.pom
[INFO] Installing /var/lib/jenkins/workspace/deploy_SOS-UBA-mergable-series/extensions/inspire/code/target/inspire-code-4.3.11-UBA-1.0.1-sources.jar to /var/lib/jenkins/.m2/repository/org/n52/sensorweb/sos/inspire-code/4.3.11-UBA-1.0.1/inspire-code-4.3.11-UBA-1.0.1-sources.jar
[INFO] Installing /var/lib/jenkins/workspace/deploy_SOS-UBA-mergable-series/extensions/inspire/code/target/inspire-code-4.3.11-UBA-1.0.1-sources.jar to /var/lib/jenkins/.m2/repository/org/n52/sensorweb/sos/inspire-code/4.3.11-UBA-1.0.1/inspire-code-4.3.11-UBA-1.0.1-sources.jar
[INFO] 
[INFO] --- maven-deploy-plugin:2.7:deploy (default-deploy) @ inspire-code ---
[INFO] Uploading: dav:https://52north.org/maven/repo/releases/org/n52/sensorweb/sos/inspire-code/4.3.11-UBA-1.0.1/inspire-code-4.3.11-UBA-1.0.1.jar
[INFO] basic authentication scheme selected
[INFO] basic authentication scheme selected
[INFO] basic authentication scheme selected
[INFO] basic authentication scheme selected
[INFO] basic authentication scheme selected
[INFO] basic authentication scheme selected
[INFO] Uploaded: dav:https://52north.org/maven/repo/releases/org/n52/sensorweb/sos/inspire-code/4.3.11-UBA-1.0.1/inspire-code-4.3.11-UBA-1.0.1.jar (174 KB at 4340.1 KB/sec)
[INFO] Uploading: dav:https://52north.org/maven/repo/releases/org/n52/sensorweb/sos/inspire-code/4.3.11-UBA-1.0.1/inspire-code-4.3.11-UBA-1.0.1.pom
[INFO] basic authentication scheme selected
[INFO] basic authentication scheme selected
[INFO] basic authentication scheme selected
[INFO] basic authentication scheme selected
[INFO] basic authentication scheme selected
[INFO] basic authentication scheme selected
[INFO] Uploaded: dav:https://52north.org/maven/repo/releases/org/n52/sensorweb/sos/inspire-code/4.3.11-UBA-1.0.1/inspire-code-4.3.11-UBA-1.0.1.pom (3 KB at 88.6 KB/sec)
[INFO] Downloading: dav:https://52north.org/maven/repo/releases/org/n52/sensorweb/sos/inspire-code/maven-metadata.xml
[INFO] Downloaded: dav:https://52north.org/maven/repo/releases/org/n52/sensorweb/sos/inspire-code/maven-metadata.xml (741 B at 42.6 KB/sec)
[INFO] Uploading: dav:https://52north.org/maven/repo/releases/org/n52/sensorweb/sos/inspire-code/maven-metadata.xml
[INFO] basic authentication scheme selected
[INFO] basic authentication scheme selected
[INFO] basic authentication scheme selected
[INFO] basic authentication scheme selected
[INFO] basic authentication scheme selected
[INFO] basic authentication scheme selected
[INFO] Uploaded: dav:https://52north.org/maven/repo/releases/org/n52/sensorweb/sos/inspire-code/maven-metadata.xml (2 KB at 52.7 KB/sec)
[INFO] Uploading: dav:https://52north.org/maven/repo/releases/org/n52/sensorweb/sos/inspire-code/4.3.11-UBA-1.0.1/inspire-code-4.3.11-UBA-1.0.1-sources.jar
[INFO] basic authentication scheme selected
[INFO] basic authentication scheme selected
[INFO] basic authentication scheme selected
[INFO] basic authentication scheme selected
[INFO] basic authentication scheme selected
[INFO] basic authentication scheme selected
[INFO] Uploaded: dav:https://52north.org/maven/repo/releases/org/n52/sensorweb/sos/inspire-code/4.3.11-UBA-1.0.1/inspire-code-4.3.11-UBA-1.0.1-sources.jar (131 KB at 3621.5 KB/sec)
[INFO] Uploading: dav:https://52north.org/maven/repo/releases/org/n52/sensorweb/sos/inspire-code/4.3.11-UBA-1.0.1/inspire-code-4.3.11-UBA-1.0.1-sources.jar
[INFO] basic authentication scheme selected
[INFO] basic authentication scheme selected
[INFO] basic authentication scheme selected
[INFO] basic authentication scheme selected
[INFO] basic authentication scheme selected
[INFO] basic authentication scheme selected
[INFO] Uploaded: dav:https://52north.org/maven/repo/releases/org/n52/sensorweb/sos/inspire-code/4.3.11-UBA-1.0.1/inspire-code-4.3.11-UBA-1.0.1-sources.jar (131 KB at 3430.9 KB/sec)
[INFO]                                                                         
[INFO] ------------------------------------------------------------------------
[INFO] Building 52°North SOS - Web Admin Controller 4.3.11-UBA-1.0.1
[INFO] ------------------------------------------------------------------------
[INFO] 
[INFO] --- maven-clean-plugin:2.5:clean (default-clean) @ admin-controller ---
[INFO] Deleting /var/lib/jenkins/workspace/deploy_SOS-UBA-mergable-series/spring/admin-controller/target
[INFO] 
[INFO] --- git-commit-id-plugin:2.1.9:revision (git-commit-id) @ admin-controller ---
[INFO] 
[INFO] --- gmaven-plugin:1.0:execute (default) @ admin-controller ---
[INFO] 
[INFO] --- maven-resources-plugin:2.6:resources (default-resources) @ admin-controller ---
[INFO] Using 'UTF-8' encoding to copy filtered resources.
[INFO] skip non existing resourceDirectory /var/lib/jenkins/workspace/deploy_SOS-UBA-mergable-series/spring/admin-controller/src/main/resources
[INFO] 
[INFO] --- maven-compiler-plugin:3.1:compile (default-compile) @ admin-controller ---
[INFO] Changes detected - recompiling the module!
[INFO] Compiling 33 source files to /var/lib/jenkins/workspace/deploy_SOS-UBA-mergable-series/spring/admin-controller/target/classes
[WARNING] bootstrap class path not set in conjunction with -source 1.7
[INFO] 
[INFO] --- maven-resources-plugin:2.6:testResources (default-testResources) @ admin-controller ---
[INFO] Using 'UTF-8' encoding to copy filtered resources.
[INFO] skip non existing resourceDirectory /var/lib/jenkins/workspace/deploy_SOS-UBA-mergable-series/spring/admin-controller/src/test/resources
[INFO] 
[INFO] --- maven-compiler-plugin:3.1:testCompile (default-testCompile) @ admin-controller ---
[INFO] No sources to compile
[INFO] 
[INFO] --- maven-surefire-plugin:2.16:test (default-test) @ admin-controller ---
[INFO] No tests to run.
[JENKINS] Recording test results
[INFO] 
[INFO] --- maven-jar-plugin:2.4:jar (default-jar) @ admin-controller ---
[INFO] Building jar: /var/lib/jenkins/workspace/deploy_SOS-UBA-mergable-series/spring/admin-controller/target/admin-controller-4.3.11-UBA-1.0.1.jar
[INFO] 
[INFO] --- maven-site-plugin:2.3:attach-descriptor (attach-descriptor) @ admin-controller ---
[INFO] 
[INFO] >>> maven-source-plugin:2.3:jar (attach-sources) > generate-sources @ admin-controller >>>
[INFO] 
[INFO] --- git-commit-id-plugin:2.1.9:revision (git-commit-id) @ admin-controller ---
[INFO] 
[INFO] --- gmaven-plugin:1.0:execute (default) @ admin-controller ---
[WARNING] Failed to getClass for org.apache.maven.plugin.source.SourceJarMojo
[INFO] 
[INFO] <<< maven-source-plugin:2.3:jar (attach-sources) < generate-sources @ admin-controller <<<
[INFO] 
[INFO] --- maven-source-plugin:2.3:jar (attach-sources) @ admin-controller ---
[INFO] Building jar: /var/lib/jenkins/workspace/deploy_SOS-UBA-mergable-series/spring/admin-controller/target/admin-controller-4.3.11-UBA-1.0.1-sources.jar
[INFO] 
[INFO] --- maven-install-plugin:2.4:install (default-install) @ admin-controller ---
[INFO] Installing /var/lib/jenkins/workspace/deploy_SOS-UBA-mergable-series/spring/admin-controller/target/admin-controller-4.3.11-UBA-1.0.1.jar to /var/lib/jenkins/.m2/repository/org/n52/sensorweb/sos/admin-controller/4.3.11-UBA-1.0.1/admin-controller-4.3.11-UBA-1.0.1.jar
[INFO] Installing /var/lib/jenkins/workspace/deploy_SOS-UBA-mergable-series/spring/admin-controller/pom.xml to /var/lib/jenkins/.m2/repository/org/n52/sensorweb/sos/admin-controller/4.3.11-UBA-1.0.1/admin-controller-4.3.11-UBA-1.0.1.pom
[INFO] Installing /var/lib/jenkins/workspace/deploy_SOS-UBA-mergable-series/spring/admin-controller/target/admin-controller-4.3.11-UBA-1.0.1-sources.jar to /var/lib/jenkins/.m2/repository/org/n52/sensorweb/sos/admin-controller/4.3.11-UBA-1.0.1/admin-controller-4.3.11-UBA-1.0.1-sources.jar
[INFO] 
[INFO] --- git-commit-id-plugin:2.1.9:revision (git-commit-id) @ admin-controller ---
[INFO] 
[INFO] --- gmaven-plugin:1.0:execute (default) @ admin-controller ---
[INFO] 
[INFO] --- maven-resources-plugin:2.6:resources (default-resources) @ admin-controller ---
[INFO] Using 'UTF-8' encoding to copy filtered resources.
[INFO] skip non existing resourceDirectory /var/lib/jenkins/workspace/deploy_SOS-UBA-mergable-series/spring/admin-controller/src/main/resources
[INFO] 
[INFO] --- maven-compiler-plugin:3.1:compile (default-compile) @ admin-controller ---
[INFO] Nothing to compile - all classes are up to date
[INFO] 
[INFO] --- maven-resources-plugin:2.6:testResources (default-testResources) @ admin-controller ---
[INFO] Using 'UTF-8' encoding to copy filtered resources.
[INFO] skip non existing resourceDirectory /var/lib/jenkins/workspace/deploy_SOS-UBA-mergable-series/spring/admin-controller/src/test/resources
[INFO] 
[INFO] --- maven-compiler-plugin:3.1:testCompile (default-testCompile) @ admin-controller ---
[INFO] No sources to compile
[INFO] 
[INFO] --- maven-surefire-plugin:2.16:test (default-test) @ admin-controller ---
[INFO] No tests to run.
[INFO] Skipping execution of surefire because it has already been run for this configuration
[JENKINS] Recording test results
[INFO] 
[INFO] --- maven-jar-plugin:2.4:jar (default-jar) @ admin-controller ---
[INFO] 
[INFO] --- maven-site-plugin:2.3:attach-descriptor (attach-descriptor) @ admin-controller ---
[INFO] 
[INFO] >>> maven-source-plugin:2.3:jar (attach-sources) > generate-sources @ admin-controller >>>
[INFO] 
[INFO] --- git-commit-id-plugin:2.1.9:revision (git-commit-id) @ admin-controller ---
[INFO] 
[INFO] --- gmaven-plugin:1.0:execute (default) @ admin-controller ---
[WARNING] Failed to getClass for org.apache.maven.plugin.source.SourceJarMojo
[INFO] 
[INFO] <<< maven-source-plugin:2.3:jar (attach-sources) < generate-sources @ admin-controller <<<
[INFO] 
[INFO] --- maven-source-plugin:2.3:jar (attach-sources) @ admin-controller ---
[INFO] 
[INFO] --- maven-install-plugin:2.4:install (default-install) @ admin-controller ---
[INFO] Installing /var/lib/jenkins/workspace/deploy_SOS-UBA-mergable-series/spring/admin-controller/target/admin-controller-4.3.11-UBA-1.0.1.jar to /var/lib/jenkins/.m2/repository/org/n52/sensorweb/sos/admin-controller/4.3.11-UBA-1.0.1/admin-controller-4.3.11-UBA-1.0.1.jar
[INFO] Installing /var/lib/jenkins/workspace/deploy_SOS-UBA-mergable-series/spring/admin-controller/pom.xml to /var/lib/jenkins/.m2/repository/org/n52/sensorweb/sos/admin-controller/4.3.11-UBA-1.0.1/admin-controller-4.3.11-UBA-1.0.1.pom
[INFO] Installing /var/lib/jenkins/workspace/deploy_SOS-UBA-mergable-series/spring/admin-controller/target/admin-controller-4.3.11-UBA-1.0.1-sources.jar to /var/lib/jenkins/.m2/repository/org/n52/sensorweb/sos/admin-controller/4.3.11-UBA-1.0.1/admin-controller-4.3.11-UBA-1.0.1-sources.jar
[INFO] Installing /var/lib/jenkins/workspace/deploy_SOS-UBA-mergable-series/spring/admin-controller/target/admin-controller-4.3.11-UBA-1.0.1-sources.jar to /var/lib/jenkins/.m2/repository/org/n52/sensorweb/sos/admin-controller/4.3.11-UBA-1.0.1/admin-controller-4.3.11-UBA-1.0.1-sources.jar
[INFO] 
[INFO] --- maven-deploy-plugin:2.7:deploy (default-deploy) @ admin-controller ---
[INFO] Uploading: dav:https://52north.org/maven/repo/releases/org/n52/sensorweb/sos/admin-controller/4.3.11-UBA-1.0.1/admin-controller-4.3.11-UBA-1.0.1.jar
[INFO] basic authentication scheme selected
[INFO] basic authentication scheme selected
[INFO] basic authentication scheme selected
[INFO] basic authentication scheme selected
[INFO] basic authentication scheme selected
[INFO] basic authentication scheme selected
[INFO] Uploaded: dav:https://52north.org/maven/repo/releases/org/n52/sensorweb/sos/admin-controller/4.3.11-UBA-1.0.1/admin-controller-4.3.11-UBA-1.0.1.jar (145 KB at 3132.0 KB/sec)
[INFO] Uploading: dav:https://52north.org/maven/repo/releases/org/n52/sensorweb/sos/admin-controller/4.3.11-UBA-1.0.1/admin-controller-4.3.11-UBA-1.0.1.pom
[INFO] basic authentication scheme selected
[INFO] basic authentication scheme selected
[INFO] basic authentication scheme selected
[INFO] basic authentication scheme selected
[INFO] basic authentication scheme selected
[INFO] basic authentication scheme selected
[INFO] Uploaded: dav:https://52north.org/maven/repo/releases/org/n52/sensorweb/sos/admin-controller/4.3.11-UBA-1.0.1/admin-controller-4.3.11-UBA-1.0.1.pom (4 KB at 119.9 KB/sec)
[INFO] Downloading: dav:https://52north.org/maven/repo/releases/org/n52/sensorweb/sos/admin-controller/maven-metadata.xml
[INFO] Downloaded: dav:https://52north.org/maven/repo/releases/org/n52/sensorweb/sos/admin-controller/maven-metadata.xml (2 KB at 36.7 KB/sec)
[INFO] Uploading: dav:https://52north.org/maven/repo/releases/org/n52/sensorweb/sos/admin-controller/maven-metadata.xml
[INFO] basic authentication scheme selected
[INFO] basic authentication scheme selected
[INFO] basic authentication scheme selected
[INFO] basic authentication scheme selected
[INFO] basic authentication scheme selected
[INFO] basic authentication scheme selected
[INFO] Uploaded: dav:https://52north.org/maven/repo/releases/org/n52/sensorweb/sos/admin-controller/maven-metadata.xml (3 KB at 78.2 KB/sec)
[INFO] Uploading: dav:https://52north.org/maven/repo/releases/org/n52/sensorweb/sos/admin-controller/4.3.11-UBA-1.0.1/admin-controller-4.3.11-UBA-1.0.1-sources.jar
[INFO] basic authentication scheme selected
[INFO] basic authentication scheme selected
[INFO] basic authentication scheme selected
[INFO] basic authentication scheme selected
[INFO] basic authentication scheme selected
[INFO] basic authentication scheme selected
[INFO] Uploaded: dav:https://52north.org/maven/repo/releases/org/n52/sensorweb/sos/admin-controller/4.3.11-UBA-1.0.1/admin-controller-4.3.11-UBA-1.0.1-sources.jar (115 KB at 2603.6 KB/sec)
[INFO] Uploading: dav:https://52north.org/maven/repo/releases/org/n52/sensorweb/sos/admin-controller/4.3.11-UBA-1.0.1/admin-controller-4.3.11-UBA-1.0.1-sources.jar
[INFO] basic authentication scheme selected
[INFO] basic authentication scheme selected
[INFO] basic authentication scheme selected
[INFO] basic authentication scheme selected
[INFO] basic authentication scheme selected
[INFO] basic authentication scheme selected
[INFO] Uploaded: dav:https://52north.org/maven/repo/releases/org/n52/sensorweb/sos/admin-controller/4.3.11-UBA-1.0.1/admin-controller-4.3.11-UBA-1.0.1-sources.jar (115 KB at 2664.2 KB/sec)
[INFO]                                                                         
[INFO] ------------------------------------------------------------------------
[INFO] Building 52°North SOS - Web Install Controller 4.3.11-UBA-1.0.1
[INFO] ------------------------------------------------------------------------
[INFO] 
[INFO] --- maven-clean-plugin:2.5:clean (default-clean) @ install-controller ---
[INFO] Deleting /var/lib/jenkins/workspace/deploy_SOS-UBA-mergable-series/spring/install-controller/target
[INFO] 
[INFO] --- git-commit-id-plugin:2.1.9:revision (git-commit-id) @ install-controller ---
[INFO] 
[INFO] --- gmaven-plugin:1.0:execute (default) @ install-controller ---
[INFO] 
[INFO] --- maven-resources-plugin:2.6:resources (default-resources) @ install-controller ---
[INFO] Using 'UTF-8' encoding to copy filtered resources.
[INFO] skip non existing resourceDirectory /var/lib/jenkins/workspace/deploy_SOS-UBA-mergable-series/spring/install-controller/src/main/resources
[INFO] 
[INFO] --- maven-compiler-plugin:3.1:compile (default-compile) @ install-controller ---
[INFO] Changes detected - recompiling the module!
[INFO] Compiling 14 source files to /var/lib/jenkins/workspace/deploy_SOS-UBA-mergable-series/spring/install-controller/target/classes
[WARNING] bootstrap class path not set in conjunction with -source 1.7
[INFO] 
[INFO] --- maven-resources-plugin:2.6:testResources (default-testResources) @ install-controller ---
[INFO] Using 'UTF-8' encoding to copy filtered resources.
[INFO] skip non existing resourceDirectory /var/lib/jenkins/workspace/deploy_SOS-UBA-mergable-series/spring/install-controller/src/test/resources
[INFO] 
[INFO] --- maven-compiler-plugin:3.1:testCompile (default-testCompile) @ install-controller ---
[INFO] No sources to compile
[INFO] 
[INFO] --- maven-surefire-plugin:2.16:test (default-test) @ install-controller ---
[INFO] No tests to run.
[JENKINS] Recording test results
[INFO] 
[INFO] --- maven-jar-plugin:2.4:jar (default-jar) @ install-controller ---
[INFO] Building jar: /var/lib/jenkins/workspace/deploy_SOS-UBA-mergable-series/spring/install-controller/target/install-controller-4.3.11-UBA-1.0.1.jar
[INFO] 
[INFO] --- maven-site-plugin:2.3:attach-descriptor (attach-descriptor) @ install-controller ---
[INFO] 
[INFO] >>> maven-source-plugin:2.3:jar (attach-sources) > generate-sources @ install-controller >>>
[INFO] 
[INFO] --- git-commit-id-plugin:2.1.9:revision (git-commit-id) @ install-controller ---
[INFO] 
[INFO] --- gmaven-plugin:1.0:execute (default) @ install-controller ---
[WARNING] Failed to getClass for org.apache.maven.plugin.source.SourceJarMojo
[INFO] 
[INFO] <<< maven-source-plugin:2.3:jar (attach-sources) < generate-sources @ install-controller <<<
[INFO] 
[INFO] --- maven-source-plugin:2.3:jar (attach-sources) @ install-controller ---
[INFO] Building jar: /var/lib/jenkins/workspace/deploy_SOS-UBA-mergable-series/spring/install-controller/target/install-controller-4.3.11-UBA-1.0.1-sources.jar
[INFO] 
[INFO] --- maven-install-plugin:2.4:install (default-install) @ install-controller ---
[INFO] Installing /var/lib/jenkins/workspace/deploy_SOS-UBA-mergable-series/spring/install-controller/target/install-controller-4.3.11-UBA-1.0.1.jar to /var/lib/jenkins/.m2/repository/org/n52/sensorweb/sos/install-controller/4.3.11-UBA-1.0.1/install-controller-4.3.11-UBA-1.0.1.jar
[INFO] Installing /var/lib/jenkins/workspace/deploy_SOS-UBA-mergable-series/spring/install-controller/pom.xml to /var/lib/jenkins/.m2/repository/org/n52/sensorweb/sos/install-controller/4.3.11-UBA-1.0.1/install-controller-4.3.11-UBA-1.0.1.pom
[INFO] Installing /var/lib/jenkins/workspace/deploy_SOS-UBA-mergable-series/spring/install-controller/target/install-controller-4.3.11-UBA-1.0.1-sources.jar to /var/lib/jenkins/.m2/repository/org/n52/sensorweb/sos/install-controller/4.3.11-UBA-1.0.1/install-controller-4.3.11-UBA-1.0.1-sources.jar
[INFO] 
[INFO] --- git-commit-id-plugin:2.1.9:revision (git-commit-id) @ install-controller ---
[INFO] 
[INFO] --- gmaven-plugin:1.0:execute (default) @ install-controller ---
[INFO] 
[INFO] --- maven-resources-plugin:2.6:resources (default-resources) @ install-controller ---
[INFO] Using 'UTF-8' encoding to copy filtered resources.
[INFO] skip non existing resourceDirectory /var/lib/jenkins/workspace/deploy_SOS-UBA-mergable-series/spring/install-controller/src/main/resources
[INFO] 
[INFO] --- maven-compiler-plugin:3.1:compile (default-compile) @ install-controller ---
[INFO] Nothing to compile - all classes are up to date
[INFO] 
[INFO] --- maven-resources-plugin:2.6:testResources (default-testResources) @ install-controller ---
[INFO] Using 'UTF-8' encoding to copy filtered resources.
[INFO] skip non existing resourceDirectory /var/lib/jenkins/workspace/deploy_SOS-UBA-mergable-series/spring/install-controller/src/test/resources
[INFO] 
[INFO] --- maven-compiler-plugin:3.1:testCompile (default-testCompile) @ install-controller ---
[INFO] No sources to compile
[INFO] 
[INFO] --- maven-surefire-plugin:2.16:test (default-test) @ install-controller ---
[INFO] No tests to run.
[INFO] Skipping execution of surefire because it has already been run for this configuration
[JENKINS] Recording test results
[INFO] 
[INFO] --- maven-jar-plugin:2.4:jar (default-jar) @ install-controller ---
[INFO] 
[INFO] --- maven-site-plugin:2.3:attach-descriptor (attach-descriptor) @ install-controller ---
[INFO] 
[INFO] >>> maven-source-plugin:2.3:jar (attach-sources) > generate-sources @ install-controller >>>
[INFO] 
[INFO] --- git-commit-id-plugin:2.1.9:revision (git-commit-id) @ install-controller ---
[INFO] 
[INFO] --- gmaven-plugin:1.0:execute (default) @ install-controller ---
[WARNING] Failed to getClass for org.apache.maven.plugin.source.SourceJarMojo
[INFO] 
[INFO] <<< maven-source-plugin:2.3:jar (attach-sources) < generate-sources @ install-controller <<<
[INFO] 
[INFO] --- maven-source-plugin:2.3:jar (attach-sources) @ install-controller ---
[INFO] 
[INFO] --- maven-install-plugin:2.4:install (default-install) @ install-controller ---
[INFO] Installing /var/lib/jenkins/workspace/deploy_SOS-UBA-mergable-series/spring/install-controller/target/install-controller-4.3.11-UBA-1.0.1.jar to /var/lib/jenkins/.m2/repository/org/n52/sensorweb/sos/install-controller/4.3.11-UBA-1.0.1/install-controller-4.3.11-UBA-1.0.1.jar
[INFO] Installing /var/lib/jenkins/workspace/deploy_SOS-UBA-mergable-series/spring/install-controller/pom.xml to /var/lib/jenkins/.m2/repository/org/n52/sensorweb/sos/install-controller/4.3.11-UBA-1.0.1/install-controller-4.3.11-UBA-1.0.1.pom
[INFO] Installing /var/lib/jenkins/workspace/deploy_SOS-UBA-mergable-series/spring/install-controller/target/install-controller-4.3.11-UBA-1.0.1-sources.jar to /var/lib/jenkins/.m2/repository/org/n52/sensorweb/sos/install-controller/4.3.11-UBA-1.0.1/install-controller-4.3.11-UBA-1.0.1-sources.jar
[INFO] Installing /var/lib/jenkins/workspace/deploy_SOS-UBA-mergable-series/spring/install-controller/target/install-controller-4.3.11-UBA-1.0.1-sources.jar to /var/lib/jenkins/.m2/repository/org/n52/sensorweb/sos/install-controller/4.3.11-UBA-1.0.1/install-controller-4.3.11-UBA-1.0.1-sources.jar
[INFO] 
[INFO] --- maven-deploy-plugin:2.7:deploy (default-deploy) @ install-controller ---
[INFO] Uploading: dav:https://52north.org/maven/repo/releases/org/n52/sensorweb/sos/install-controller/4.3.11-UBA-1.0.1/install-controller-4.3.11-UBA-1.0.1.jar
[INFO] basic authentication scheme selected
[INFO] basic authentication scheme selected
[INFO] basic authentication scheme selected
[INFO] basic authentication scheme selected
[INFO] basic authentication scheme selected
[INFO] basic authentication scheme selected
[INFO] Uploaded: dav:https://52north.org/maven/repo/releases/org/n52/sensorweb/sos/install-controller/4.3.11-UBA-1.0.1/install-controller-4.3.11-UBA-1.0.1.jar (64 KB at 1163.4 KB/sec)
[INFO] Uploading: dav:https://52north.org/maven/repo/releases/org/n52/sensorweb/sos/install-controller/4.3.11-UBA-1.0.1/install-controller-4.3.11-UBA-1.0.1.pom
[INFO] basic authentication scheme selected
[INFO] basic authentication scheme selected
[INFO] basic authentication scheme selected
[INFO] basic authentication scheme selected
[INFO] basic authentication scheme selected
[INFO] basic authentication scheme selected
[INFO] Uploaded: dav:https://52north.org/maven/repo/releases/org/n52/sensorweb/sos/install-controller/4.3.11-UBA-1.0.1/install-controller-4.3.11-UBA-1.0.1.pom (4 KB at 93.1 KB/sec)
[INFO] Downloading: dav:https://52north.org/maven/repo/releases/org/n52/sensorweb/sos/install-controller/maven-metadata.xml
[INFO] Downloaded: dav:https://52north.org/maven/repo/releases/org/n52/sensorweb/sos/install-controller/maven-metadata.xml (2 KB at 67.4 KB/sec)
[INFO] Uploading: dav:https://52north.org/maven/repo/releases/org/n52/sensorweb/sos/install-controller/maven-metadata.xml
[INFO] basic authentication scheme selected
[INFO] basic authentication scheme selected
[INFO] basic authentication scheme selected
[INFO] basic authentication scheme selected
[INFO] basic authentication scheme selected
[INFO] basic authentication scheme selected
[INFO] Uploaded: dav:https://52north.org/maven/repo/releases/org/n52/sensorweb/sos/install-controller/maven-metadata.xml (3 KB at 83.6 KB/sec)
[INFO] Uploading: dav:https://52north.org/maven/repo/releases/org/n52/sensorweb/sos/install-controller/4.3.11-UBA-1.0.1/install-controller-4.3.11-UBA-1.0.1-sources.jar
[INFO] basic authentication scheme selected
[INFO] basic authentication scheme selected
[INFO] basic authentication scheme selected
[INFO] basic authentication scheme selected
[INFO] basic authentication scheme selected
[INFO] basic authentication scheme selected
[INFO] Uploaded: dav:https://52north.org/maven/repo/releases/org/n52/sensorweb/sos/install-controller/4.3.11-UBA-1.0.1/install-controller-4.3.11-UBA-1.0.1-sources.jar (50 KB at 1301.9 KB/sec)
[INFO] Uploading: dav:https://52north.org/maven/repo/releases/org/n52/sensorweb/sos/install-controller/4.3.11-UBA-1.0.1/install-controller-4.3.11-UBA-1.0.1-sources.jar
[INFO] basic authentication scheme selected
[INFO] basic authentication scheme selected
[INFO] basic authentication scheme selected
[INFO] basic authentication scheme selected
[INFO] basic authentication scheme selected
[INFO] basic authentication scheme selected
[INFO] Uploaded: dav:https://52north.org/maven/repo/releases/org/n52/sensorweb/sos/install-controller/4.3.11-UBA-1.0.1/install-controller-4.3.11-UBA-1.0.1-sources.jar (50 KB at 1268.5 KB/sec)
[INFO]                                                                         
[INFO] ------------------------------------------------------------------------
[INFO] Building 52°North SOS - Web Client Controller 4.3.11-UBA-1.0.1
[INFO] ------------------------------------------------------------------------
[INFO] 
[INFO] --- maven-clean-plugin:2.5:clean (default-clean) @ client-controller ---
[INFO] Deleting /var/lib/jenkins/workspace/deploy_SOS-UBA-mergable-series/spring/client-controller/target
[INFO] 
[INFO] --- git-commit-id-plugin:2.1.9:revision (git-commit-id) @ client-controller ---
[INFO] 
[INFO] --- gmaven-plugin:1.0:execute (default) @ client-controller ---
[INFO] 
[INFO] --- maven-resources-plugin:2.6:resources (default-resources) @ client-controller ---
[INFO] Using 'UTF-8' encoding to copy filtered resources.
[INFO] skip non existing resourceDirectory /var/lib/jenkins/workspace/deploy_SOS-UBA-mergable-series/spring/client-controller/src/main/resources
[INFO] 
[INFO] --- maven-compiler-plugin:3.1:compile (default-compile) @ client-controller ---
[INFO] Changes detected - recompiling the module!
[INFO] Compiling 1 source file to /var/lib/jenkins/workspace/deploy_SOS-UBA-mergable-series/spring/client-controller/target/classes
[WARNING] bootstrap class path not set in conjunction with -source 1.7
[INFO] 
[INFO] --- maven-resources-plugin:2.6:testResources (default-testResources) @ client-controller ---
[INFO] Using 'UTF-8' encoding to copy filtered resources.
[INFO] skip non existing resourceDirectory /var/lib/jenkins/workspace/deploy_SOS-UBA-mergable-series/spring/client-controller/src/test/resources
[INFO] 
[INFO] --- maven-compiler-plugin:3.1:testCompile (default-testCompile) @ client-controller ---
[INFO] No sources to compile
[INFO] 
[INFO] --- maven-surefire-plugin:2.16:test (default-test) @ client-controller ---
[INFO] No tests to run.
[JENKINS] Recording test results
[INFO] 
[INFO] --- maven-jar-plugin:2.4:jar (default-jar) @ client-controller ---
[INFO] Building jar: /var/lib/jenkins/workspace/deploy_SOS-UBA-mergable-series/spring/client-controller/target/client-controller-4.3.11-UBA-1.0.1.jar
[INFO] 
[INFO] --- maven-site-plugin:2.3:attach-descriptor (attach-descriptor) @ client-controller ---
[INFO] 
[INFO] >>> maven-source-plugin:2.3:jar (attach-sources) > generate-sources @ client-controller >>>
[INFO] 
[INFO] --- git-commit-id-plugin:2.1.9:revision (git-commit-id) @ client-controller ---
[INFO] 
[INFO] --- gmaven-plugin:1.0:execute (default) @ client-controller ---
[WARNING] Failed to getClass for org.apache.maven.plugin.source.SourceJarMojo
[INFO] 
[INFO] <<< maven-source-plugin:2.3:jar (attach-sources) < generate-sources @ client-controller <<<
[INFO] 
[INFO] --- maven-source-plugin:2.3:jar (attach-sources) @ client-controller ---
[INFO] Building jar: /var/lib/jenkins/workspace/deploy_SOS-UBA-mergable-series/spring/client-controller/target/client-controller-4.3.11-UBA-1.0.1-sources.jar
[INFO] 
[INFO] --- maven-install-plugin:2.4:install (default-install) @ client-controller ---
[INFO] Installing /var/lib/jenkins/workspace/deploy_SOS-UBA-mergable-series/spring/client-controller/target/client-controller-4.3.11-UBA-1.0.1.jar to /var/lib/jenkins/.m2/repository/org/n52/sensorweb/sos/client-controller/4.3.11-UBA-1.0.1/client-controller-4.3.11-UBA-1.0.1.jar
[INFO] Installing /var/lib/jenkins/workspace/deploy_SOS-UBA-mergable-series/spring/client-controller/pom.xml to /var/lib/jenkins/.m2/repository/org/n52/sensorweb/sos/client-controller/4.3.11-UBA-1.0.1/client-controller-4.3.11-UBA-1.0.1.pom
[INFO] Installing /var/lib/jenkins/workspace/deploy_SOS-UBA-mergable-series/spring/client-controller/target/client-controller-4.3.11-UBA-1.0.1-sources.jar to /var/lib/jenkins/.m2/repository/org/n52/sensorweb/sos/client-controller/4.3.11-UBA-1.0.1/client-controller-4.3.11-UBA-1.0.1-sources.jar
[INFO] 
[INFO] --- git-commit-id-plugin:2.1.9:revision (git-commit-id) @ client-controller ---
[INFO] 
[INFO] --- gmaven-plugin:1.0:execute (default) @ client-controller ---
[INFO] 
[INFO] --- maven-resources-plugin:2.6:resources (default-resources) @ client-controller ---
[INFO] Using 'UTF-8' encoding to copy filtered resources.
[INFO] skip non existing resourceDirectory /var/lib/jenkins/workspace/deploy_SOS-UBA-mergable-series/spring/client-controller/src/main/resources
[INFO] 
[INFO] --- maven-compiler-plugin:3.1:compile (default-compile) @ client-controller ---
[INFO] Nothing to compile - all classes are up to date
[INFO] 
[INFO] --- maven-resources-plugin:2.6:testResources (default-testResources) @ client-controller ---
[INFO] Using 'UTF-8' encoding to copy filtered resources.
[INFO] skip non existing resourceDirectory /var/lib/jenkins/workspace/deploy_SOS-UBA-mergable-series/spring/client-controller/src/test/resources
[INFO] 
[INFO] --- maven-compiler-plugin:3.1:testCompile (default-testCompile) @ client-controller ---
[INFO] No sources to compile
[INFO] 
[INFO] --- maven-surefire-plugin:2.16:test (default-test) @ client-controller ---
[INFO] No tests to run.
[INFO] Skipping execution of surefire because it has already been run for this configuration
[JENKINS] Recording test results
[INFO] 
[INFO] --- maven-jar-plugin:2.4:jar (default-jar) @ client-controller ---
[INFO] 
[INFO] --- maven-site-plugin:2.3:attach-descriptor (attach-descriptor) @ client-controller ---
[INFO] 
[INFO] >>> maven-source-plugin:2.3:jar (attach-sources) > generate-sources @ client-controller >>>
[INFO] 
[INFO] --- git-commit-id-plugin:2.1.9:revision (git-commit-id) @ client-controller ---
[INFO] 
[INFO] --- gmaven-plugin:1.0:execute (default) @ client-controller ---
[WARNING] Failed to getClass for org.apache.maven.plugin.source.SourceJarMojo
[INFO] 
[INFO] <<< maven-source-plugin:2.3:jar (attach-sources) < generate-sources @ client-controller <<<
[INFO] 
[INFO] --- maven-source-plugin:2.3:jar (attach-sources) @ client-controller ---
[INFO] 
[INFO] --- maven-install-plugin:2.4:install (default-install) @ client-controller ---
[INFO] Installing /var/lib/jenkins/workspace/deploy_SOS-UBA-mergable-series/spring/client-controller/target/client-controller-4.3.11-UBA-1.0.1.jar to /var/lib/jenkins/.m2/repository/org/n52/sensorweb/sos/client-controller/4.3.11-UBA-1.0.1/client-controller-4.3.11-UBA-1.0.1.jar
[INFO] Installing /var/lib/jenkins/workspace/deploy_SOS-UBA-mergable-series/spring/client-controller/pom.xml to /var/lib/jenkins/.m2/repository/org/n52/sensorweb/sos/client-controller/4.3.11-UBA-1.0.1/client-controller-4.3.11-UBA-1.0.1.pom
[INFO] Installing /var/lib/jenkins/workspace/deploy_SOS-UBA-mergable-series/spring/client-controller/target/client-controller-4.3.11-UBA-1.0.1-sources.jar to /var/lib/jenkins/.m2/repository/org/n52/sensorweb/sos/client-controller/4.3.11-UBA-1.0.1/client-controller-4.3.11-UBA-1.0.1-sources.jar
[INFO] Installing /var/lib/jenkins/workspace/deploy_SOS-UBA-mergable-series/spring/client-controller/target/client-controller-4.3.11-UBA-1.0.1-sources.jar to /var/lib/jenkins/.m2/repository/org/n52/sensorweb/sos/client-controller/4.3.11-UBA-1.0.1/client-controller-4.3.11-UBA-1.0.1-sources.jar
[INFO] 
[INFO] --- maven-deploy-plugin:2.7:deploy (default-deploy) @ client-controller ---
[INFO] Uploading: dav:https://52north.org/maven/repo/releases/org/n52/sensorweb/sos/client-controller/4.3.11-UBA-1.0.1/client-controller-4.3.11-UBA-1.0.1.jar
[INFO] basic authentication scheme selected
[INFO] basic authentication scheme selected
[INFO] basic authentication scheme selected
[INFO] basic authentication scheme selected
[INFO] basic authentication scheme selected
[INFO] basic authentication scheme selected
[INFO] Uploaded: dav:https://52north.org/maven/repo/releases/org/n52/sensorweb/sos/client-controller/4.3.11-UBA-1.0.1/client-controller-4.3.11-UBA-1.0.1.jar (11 KB at 273.6 KB/sec)
[INFO] Uploading: dav:https://52north.org/maven/repo/releases/org/n52/sensorweb/sos/client-controller/4.3.11-UBA-1.0.1/client-controller-4.3.11-UBA-1.0.1.pom
[INFO] basic authentication scheme selected
[INFO] basic authentication scheme selected
[INFO] basic authentication scheme selected
[INFO] basic authentication scheme selected
[INFO] basic authentication scheme selected
[INFO] basic authentication scheme selected
[INFO] Uploaded: dav:https://52north.org/maven/repo/releases/org/n52/sensorweb/sos/client-controller/4.3.11-UBA-1.0.1/client-controller-4.3.11-UBA-1.0.1.pom (2 KB at 41.7 KB/sec)
[INFO] Downloading: dav:https://52north.org/maven/repo/releases/org/n52/sensorweb/sos/client-controller/maven-metadata.xml
[INFO] Downloaded: dav:https://52north.org/maven/repo/releases/org/n52/sensorweb/sos/client-controller/maven-metadata.xml (2 KB at 57.7 KB/sec)
[INFO] Uploading: dav:https://52north.org/maven/repo/releases/org/n52/sensorweb/sos/client-controller/maven-metadata.xml
[INFO] basic authentication scheme selected
[INFO] basic authentication scheme selected
[INFO] basic authentication scheme selected
[INFO] basic authentication scheme selected
[INFO] basic authentication scheme selected
[INFO] basic authentication scheme selected
[INFO] Uploaded: dav:https://52north.org/maven/repo/releases/org/n52/sensorweb/sos/client-controller/maven-metadata.xml (3 KB at 78.3 KB/sec)
[INFO] Uploading: dav:https://52north.org/maven/repo/releases/org/n52/sensorweb/sos/client-controller/4.3.11-UBA-1.0.1/client-controller-4.3.11-UBA-1.0.1-sources.jar
[INFO] basic authentication scheme selected
[INFO] basic authentication scheme selected
[INFO] basic authentication scheme selected
[INFO] basic authentication scheme selected
[INFO] basic authentication scheme selected
[INFO] basic authentication scheme selected
[INFO] Uploaded: dav:https://52north.org/maven/repo/releases/org/n52/sensorweb/sos/client-controller/4.3.11-UBA-1.0.1/client-controller-4.3.11-UBA-1.0.1-sources.jar (6 KB at 164.1 KB/sec)
[INFO] Uploading: dav:https://52north.org/maven/repo/releases/org/n52/sensorweb/sos/client-controller/4.3.11-UBA-1.0.1/client-controller-4.3.11-UBA-1.0.1-sources.jar
[INFO] basic authentication scheme selected
[INFO] basic authentication scheme selected
[INFO] basic authentication scheme selected
[INFO] basic authentication scheme selected
[INFO] basic authentication scheme selected
[INFO] basic authentication scheme selected
[INFO] Uploaded: dav:https://52north.org/maven/repo/releases/org/n52/sensorweb/sos/client-controller/4.3.11-UBA-1.0.1/client-controller-4.3.11-UBA-1.0.1-sources.jar (6 KB at 123.0 KB/sec)
[INFO]                                                                         
[INFO] ------------------------------------------------------------------------
[INFO] Building 52°North SOS - Web Views 4.3.11-UBA-1.0.1
[INFO] ------------------------------------------------------------------------
[INFO] 
[INFO] --- maven-clean-plugin:2.5:clean (default-clean) @ views ---
[INFO] Deleting /var/lib/jenkins/workspace/deploy_SOS-UBA-mergable-series/spring/views/target
[INFO] 
[INFO] --- git-commit-id-plugin:2.1.9:revision (git-commit-id) @ views ---
[INFO] 
[INFO] --- gmaven-plugin:1.0:execute (default) @ views ---
[INFO] 
[INFO] --- maven-resources-plugin:2.6:resources (default-resources) @ views ---
[INFO] Using 'UTF-8' encoding to copy filtered resources.
[INFO] skip non existing resourceDirectory /var/lib/jenkins/workspace/deploy_SOS-UBA-mergable-series/spring/views/src/main/resources
[INFO] 
[INFO] --- maven-compiler-plugin:3.1:compile (default-compile) @ views ---
[INFO] No sources to compile
[INFO] 
[INFO] --- maven-resources-plugin:2.6:testResources (default-testResources) @ views ---
[INFO] Using 'UTF-8' encoding to copy filtered resources.
[INFO] skip non existing resourceDirectory /var/lib/jenkins/workspace/deploy_SOS-UBA-mergable-series/spring/views/src/test/resources
[INFO] 
[INFO] --- maven-compiler-plugin:3.1:testCompile (default-testCompile) @ views ---
[INFO] No sources to compile
[INFO] 
[INFO] --- maven-surefire-plugin:2.16:test (default-test) @ views ---
[INFO] No tests to run.
[JENKINS] Recording test results
[INFO] 
[INFO] --- maven-war-plugin:2.3:war (default-war) @ views ---
[INFO] Packaging webapp
[INFO] Assembling webapp [views] in [/var/lib/jenkins/workspace/deploy_SOS-UBA-mergable-series/spring/views/target/views-4.3.11-UBA-1.0.1]
[INFO] Processing war project
[INFO] Copying webapp resources [/var/lib/jenkins/workspace/deploy_SOS-UBA-mergable-series/spring/views/src/main/webapp]
[INFO] Webapp assembled in [560 msecs]
[INFO] Building war: /var/lib/jenkins/workspace/deploy_SOS-UBA-mergable-series/spring/views/target/views-4.3.11-UBA-1.0.1.war
[INFO] 
[INFO] --- maven-site-plugin:2.3:attach-descriptor (attach-descriptor) @ views ---
[INFO] 
[INFO] >>> maven-source-plugin:2.3:jar (attach-sources) > generate-sources @ views >>>
[INFO] 
[INFO] --- git-commit-id-plugin:2.1.9:revision (git-commit-id) @ views ---
[INFO] 
[INFO] --- gmaven-plugin:1.0:execute (default) @ views ---
[WARNING] Failed to getClass for org.apache.maven.plugin.source.SourceJarMojo
[INFO] 
[INFO] <<< maven-source-plugin:2.3:jar (attach-sources) < generate-sources @ views <<<
[INFO] 
[INFO] --- maven-source-plugin:2.3:jar (attach-sources) @ views ---
[INFO] No sources in project. Archive not created.
[INFO] 
[INFO] --- maven-install-plugin:2.4:install (default-install) @ views ---
[INFO] Installing /var/lib/jenkins/workspace/deploy_SOS-UBA-mergable-series/spring/views/target/views-4.3.11-UBA-1.0.1.war to /var/lib/jenkins/.m2/repository/org/n52/sensorweb/sos/views/4.3.11-UBA-1.0.1/views-4.3.11-UBA-1.0.1.war
[INFO] Installing /var/lib/jenkins/workspace/deploy_SOS-UBA-mergable-series/spring/views/pom.xml to /var/lib/jenkins/.m2/repository/org/n52/sensorweb/sos/views/4.3.11-UBA-1.0.1/views-4.3.11-UBA-1.0.1.pom
[INFO] 
[INFO] --- git-commit-id-plugin:2.1.9:revision (git-commit-id) @ views ---
[INFO] 
[INFO] --- gmaven-plugin:1.0:execute (default) @ views ---
[INFO] 
[INFO] --- maven-resources-plugin:2.6:resources (default-resources) @ views ---
[INFO] Using 'UTF-8' encoding to copy filtered resources.
[INFO] skip non existing resourceDirectory /var/lib/jenkins/workspace/deploy_SOS-UBA-mergable-series/spring/views/src/main/resources
[INFO] 
[INFO] --- maven-compiler-plugin:3.1:compile (default-compile) @ views ---
[INFO] No sources to compile
[INFO] 
[INFO] --- maven-resources-plugin:2.6:testResources (default-testResources) @ views ---
[INFO] Using 'UTF-8' encoding to copy filtered resources.
[INFO] skip non existing resourceDirectory /var/lib/jenkins/workspace/deploy_SOS-UBA-mergable-series/spring/views/src/test/resources
[INFO] 
[INFO] --- maven-compiler-plugin:3.1:testCompile (default-testCompile) @ views ---
[INFO] No sources to compile
[INFO] 
[INFO] --- maven-surefire-plugin:2.16:test (default-test) @ views ---
[INFO] No tests to run.
[INFO] Skipping execution of surefire because it has already been run for this configuration
[JENKINS] Recording test results
[INFO] 
[INFO] --- maven-war-plugin:2.3:war (default-war) @ views ---
[INFO] Packaging webapp
[INFO] Assembling webapp [views] in [/var/lib/jenkins/workspace/deploy_SOS-UBA-mergable-series/spring/views/target/views-4.3.11-UBA-1.0.1]
[INFO] Processing war project
[INFO] Copying webapp resources [/var/lib/jenkins/workspace/deploy_SOS-UBA-mergable-series/spring/views/src/main/webapp]
[INFO] Webapp assembled in [925 msecs]
[INFO] Building war: /var/lib/jenkins/workspace/deploy_SOS-UBA-mergable-series/spring/views/target/views-4.3.11-UBA-1.0.1.war
[INFO] 
[INFO] --- maven-site-plugin:2.3:attach-descriptor (attach-descriptor) @ views ---
[INFO] 
[INFO] >>> maven-source-plugin:2.3:jar (attach-sources) > generate-sources @ views >>>
[INFO] 
[INFO] --- git-commit-id-plugin:2.1.9:revision (git-commit-id) @ views ---
[INFO] 
[INFO] --- gmaven-plugin:1.0:execute (default) @ views ---
[WARNING] Failed to getClass for org.apache.maven.plugin.source.SourceJarMojo
[INFO] 
[INFO] <<< maven-source-plugin:2.3:jar (attach-sources) < generate-sources @ views <<<
[INFO] 
[INFO] --- maven-source-plugin:2.3:jar (attach-sources) @ views ---
[INFO] No sources in project. Archive not created.
[INFO] 
[INFO] --- maven-install-plugin:2.4:install (default-install) @ views ---
[INFO] Installing /var/lib/jenkins/workspace/deploy_SOS-UBA-mergable-series/spring/views/target/views-4.3.11-UBA-1.0.1.war to /var/lib/jenkins/.m2/repository/org/n52/sensorweb/sos/views/4.3.11-UBA-1.0.1/views-4.3.11-UBA-1.0.1.war
[INFO] Installing /var/lib/jenkins/workspace/deploy_SOS-UBA-mergable-series/spring/views/pom.xml to /var/lib/jenkins/.m2/repository/org/n52/sensorweb/sos/views/4.3.11-UBA-1.0.1/views-4.3.11-UBA-1.0.1.pom
[INFO] 
[INFO] --- maven-deploy-plugin:2.7:deploy (default-deploy) @ views ---
[INFO] Uploading: dav:https://52north.org/maven/repo/releases/org/n52/sensorweb/sos/views/4.3.11-UBA-1.0.1/views-4.3.11-UBA-1.0.1.war
[INFO] basic authentication scheme selected
[INFO] basic authentication scheme selected
[INFO] basic authentication scheme selected
[INFO] basic authentication scheme selected
[INFO] basic authentication scheme selected
[INFO] basic authentication scheme selected
[INFO] Uploaded: dav:https://52north.org/maven/repo/releases/org/n52/sensorweb/sos/views/4.3.11-UBA-1.0.1/views-4.3.11-UBA-1.0.1.war (69462 KB at 34870.0 KB/sec)
[INFO] Uploading: dav:https://52north.org/maven/repo/releases/org/n52/sensorweb/sos/views/4.3.11-UBA-1.0.1/views-4.3.11-UBA-1.0.1.pom
[INFO] basic authentication scheme selected
[INFO] basic authentication scheme selected
[INFO] basic authentication scheme selected
[INFO] basic authentication scheme selected
[INFO] basic authentication scheme selected
[INFO] basic authentication scheme selected
[INFO] Uploaded: dav:https://52north.org/maven/repo/releases/org/n52/sensorweb/sos/views/4.3.11-UBA-1.0.1/views-4.3.11-UBA-1.0.1.pom (5 KB at 135.9 KB/sec)
[INFO] Downloading: dav:https://52north.org/maven/repo/releases/org/n52/sensorweb/sos/views/maven-metadata.xml
[INFO] Downloaded: dav:https://52north.org/maven/repo/releases/org/n52/sensorweb/sos/views/maven-metadata.xml (2 KB at 4.4 KB/sec)
[INFO] Uploading: dav:https://52north.org/maven/repo/releases/org/n52/sensorweb/sos/views/maven-metadata.xml
[INFO] basic authentication scheme selected
[INFO] basic authentication scheme selected
[INFO] basic authentication scheme selected
[INFO] basic authentication scheme selected
[INFO] basic authentication scheme selected
[INFO] basic authentication scheme selected
[INFO] Uploaded: dav:https://52north.org/maven/repo/releases/org/n52/sensorweb/sos/views/maven-metadata.xml (3 KB at 37.1 KB/sec)
[INFO]                                                                         
[INFO] ------------------------------------------------------------------------
[INFO] Building 52°North SOS - Webapp 4.3.11-UBA-1.0.1
[INFO] ------------------------------------------------------------------------
[INFO] Downloading: http://localhost/nexus/content/groups/public/org/n52/sensorweb/52n-xml-sosdo-v10/2.1.1-SNAPSHOT/maven-metadata.xml
[INFO] Downloaded: http://localhost/nexus/content/groups/public/org/n52/sensorweb/52n-xml-sosdo-v10/2.1.1-SNAPSHOT/maven-metadata.xml (784 B at 0.0 KB/sec)
[INFO] Downloading: http://localhost/nexus/content/groups/public/org/n52/sensorweb/52n-common-xml/2.1.1-SNAPSHOT/maven-metadata.xml
[INFO] Downloaded: http://localhost/nexus/content/groups/public/org/n52/sensorweb/52n-common-xml/2.1.1-SNAPSHOT/maven-metadata.xml (610 B at 2.0 KB/sec)
[INFO] Downloading: http://localhost/nexus/content/groups/public/org/n52/sensorweb/sos/hibernate-datasource-oracle/4.3.11-UBA-1.0.1/hibernate-datasource-oracle-4.3.11-UBA-1.0.1.pom
[WARNING] The POM for org.n52.sensorweb.sos:hibernate-datasource-oracle:jar:4.3.11-UBA-1.0.1 is missing, no dependency information available
[INFO] Downloading: http://localhost/nexus/content/groups/public/org/n52/sensorweb/sos/hibernate-datasource-sqlserver/4.3.11-UBA-1.0.1/hibernate-datasource-sqlserver-4.3.11-UBA-1.0.1.pom
[WARNING] The POM for org.n52.sensorweb.sos:hibernate-datasource-sqlserver:jar:4.3.11-UBA-1.0.1 is missing, no dependency information available
[INFO] Downloading: http://localhost/nexus/content/groups/public/org/n52/sensorweb/sos/hibernate-datasource-oracle/4.3.11-UBA-1.0.1/hibernate-datasource-oracle-4.3.11-UBA-1.0.1.jar
[INFO] Downloading: http://localhost/nexus/content/groups/public/org/n52/sensorweb/sos/hibernate-datasource-sqlserver/4.3.11-UBA-1.0.1/hibernate-datasource-sqlserver-4.3.11-UBA-1.0.1.jar
[INFO] ------------------------------------------------------------------------
[INFO] Reactor Summary:
[INFO] 
[INFO] 52°North Sensor Observation Service ................ SUCCESS [ 21.167 s]
[INFO] 52°North SOS - Core Modules ........................ SUCCESS [  1.027 s]
[INFO] 52°North SOS - Test Module ......................... SUCCESS [  3.873 s]
[INFO] 52°North Aggregated Third Party modules ............ SUCCESS [  1.081 s]
[INFO] 52°North Third Party - NCName resolver ............. SUCCESS [  4.493 s]
[INFO] 52°North SOS - SOS API Module ...................... SUCCESS [ 14.870 s]
[INFO] 52°North SOS - Administrator Service Operator ...... SUCCESS [  2.846 s]
[INFO] 52°North SOS - Cache ............................... SUCCESS [  4.913 s]
[INFO] 52°North SOS - GetCapabilities DAO ................. SUCCESS [  2.041 s]
[INFO] 52°North SOS - Profile Module ...................... SUCCESS [  1.231 s]
[INFO] 52°North SOS - Profile XmlBeans Module ............. SUCCESS [  3.457 s]
[INFO] 52°North SOS - Profile Coding Module ............... SUCCESS [  3.749 s]
[INFO] 52°North SOS - Hibernate Module .................... SUCCESS [  1.195 s]
[INFO] 52°North SOS - Hibernate Session Factory ........... SUCCESS [  4.755 s]
[INFO] 52°North SOS - SQLite Configuration ................ SUCCESS [  9.626 s]
[INFO] 52°North SOS - Binding Modules ..................... SUCCESS [  1.093 s]
[INFO] 52°North SOS - KVP Binding ......................... SUCCESS [  3.069 s]
[INFO] 52°North SOS - POX Binding ......................... SUCCESS [  1.912 s]
[INFO] 52°North SOS - SOAP Binding ........................ SUCCESS [  3.296 s]
[INFO] 52°North SOS - Extension REST Binding .............. SUCCESS [  1.000 s]
[INFO] 52°North SOS - Extension REST Binding - XML ........ SUCCESS [  2.956 s]
[INFO] 52°North SOS - Coding Modules ...................... SUCCESS [  0.987 s]
[INFO] 52°North SOS - 2.0 XML Request Coding .............. SUCCESS [  5.197 s]
[INFO] 52°North SOS - Abstract SensorML Coding Module ..... SUCCESS [  2.371 s]
[INFO] 52°North SOS - SensorML 101 Request Coding ......... SUCCESS [ 18.528 s]
[INFO] 52°North SOS - Extension Modules ................... SUCCESS [  0.999 s]
[INFO] 52°North SOS - Extension Delete Observation ........ SUCCESS [  0.981 s]
[INFO] 52°North SOS - Extension Delete Observation - XML .. SUCCESS [  4.358 s]
[INFO] 52°North SOS - WaterML 2.0 XML Coding .............. SUCCESS [  2.069 s]
[INFO] 52°North SOS - Hibernate Mappings .................. SUCCESS [  2.556 s]
[INFO] 52°North SOS - Hibernate H2 ........................ SUCCESS [  3.626 s]
[INFO] 52°North SOS - Extension for AQD ................... SUCCESS [  0.991 s]
[INFO] 52°North SOS - AQD 1.0 API Operator ................ SUCCESS [  2.045 s]
[INFO] 52°North SOS - Hibernate Common .................... SUCCESS [ 39.626 s]
[INFO] 52°North SOS - Extension Delete Observation - Operation SUCCESS [  4.797 s]
[INFO] 52°North SOS - Extension REST Binding - Core ....... SUCCESS [  4.015 s]
[INFO] 52°North SOS - JSON Common ......................... SUCCESS [  3.978 s]
[INFO] 52°North SOS - JSON Coding ......................... SUCCESS [ 11.283 s]
[INFO] 52°North SOS - JSON Binding ........................ SUCCESS [  1.848 s]
[INFO] 52°North SOS - Extension GetDataAvailability ....... SUCCESS [  1.381 s]
[INFO] 52°North SOS - Extension GetDataAvailability - SOS 2.0 Operation SUCCESS [  2.349 s]
[INFO] 52°North SOS - EXI Coding .......................... SUCCESS [  3.566 s]
[INFO] 52°North SOS - EXI Efficient XML Interchange Binding SUCCESS [  2.392 s]
[INFO] 52°North SOS - OWS 1.1.0 XML Request Coding ........ SUCCESS [  7.112 s]
[INFO] 52°North SOS - SensorML 20 Request Coding .......... SUCCESS [  5.550 s]
[INFO] 52°North SOS - SOS 1.0.0 XML Request Coding ........ SUCCESS [  9.001 s]
[INFO] 52°North SOS - Converter Modules ................... SUCCESS [ 14.370 s]
[INFO] 52°North SOS - Converter Modules ................... SUCCESS [  2.588 s]
[INFO] 52°North SOS - Coordinate transformation module .... SUCCESS [  1.966 s]
[INFO] 52°North SOS - Identifier Modifier Modules ......... SUCCESS [  0.980 s]
[INFO] 52°North SOS - Abstract Identifier Modifier Modules  SUCCESS [  2.221 s]
[INFO] 52°North SOS - Flexible identifier convert module .. SUCCESS [  2.023 s]
[INFO] 52°North SOS - Prefixed identifier convert module .. SUCCESS [  2.158 s]
[INFO] 52°North SOS - Split and Merge observations module . SUCCESS [  1.931 s]
[INFO] 52°North SOS - Operation Request Operators ......... SUCCESS [  0.926 s]
[INFO] 52°North SOS - SOS 1.0.0 Core Profile Operator ..... SUCCESS [  1.878 s]
[INFO] 52°North SOS - SOS 2.0 Core Profile Operator ....... SUCCESS [  2.739 s]
[INFO] 52°North SOS - SOS 2.0 Enhanced Profile Operator ... SUCCESS [  1.929 s]
[INFO] 52°North SOS - SOS 2.0 Result Handling Profile Operator SUCCESS [  1.931 s]
[INFO] 52°North SOS - SOS 2.0 Transactional Profile Operator SUCCESS [  1.951 s]
[INFO] 52°North SOS - Hibernate DAOs ...................... SUCCESS [ 36.647 s]
[INFO] 52°North SOS - Hibernate Feature Query DAO ......... SUCCESS [ 34.899 s]
[INFO] 52°North SOS - Hibernate Datasources ............... SUCCESS [  1.126 s]
[INFO] 52°North SOS - Hibernate Common Datasource ......... SUCCESS [  2.822 s]
[INFO] 52°North SOS - Hibernate Postgres/PostGIS Datasource SUCCESS [  2.206 s]
[INFO] 52°North SOS - Hibernate H2 Datasource ............. SUCCESS [  2.065 s]
[INFO] 52°North SOS - Hibernate MySQL Datasource .......... SUCCESS [  2.016 s]
[INFO] 52°North SOS - Hibernate Oracle Datasource ......... SUCCESS [ 21.704 s]
[INFO] 52°North SOS - Hibernate SQL Server Datasource ..... SUCCESS [  4.925 s]
[INFO] 52°North SOS - Web Modules ......................... SUCCESS [  1.007 s]
[INFO] 52°North SOS - Web Common Controller ............... SUCCESS [  2.454 s]
[INFO] 52°North SOS - SOS 2.0 eReporting Extension ........ SUCCESS [  5.832 s]
[INFO] 52°North SOS - AQD 1.0 Core Profile Operator ....... SUCCESS [  2.105 s]
[INFO] 52°North SOS - Extension for AQD coding ............ SUCCESS [  0.945 s]
[INFO] 52°North AQD - 1.0 XML Coding ...................... SUCCESS [  2.662 s]
[INFO] 52°North SOS - AQD Split and Merge observations module SUCCESS [  1.852 s]
[INFO] 52°North SOS - eReporting Prefixed identifier convert module SUCCESS [  1.874 s]
[INFO] 52°North SOS - Extension GetDataAvailability - Hibernate DAO SUCCESS [  2.054 s]
[INFO] 52°North SOS - Extension Delete Observation - Hibernate DAO SUCCESS [  6.341 s]
[INFO] 52°North SOS - Extension Delete Observation - KVP .. SUCCESS [  2.479 s]
[INFO] 52°North SOS - Extension Delete Observation - JSON . SUCCESS [  3.482 s]
[INFO] 52°North SOS - SOS 2.0 Inspire extension ........... SUCCESS [  0.979 s]
[INFO] 52°North SOS - Extension for Inspire - Code Module . SUCCESS [  2.224 s]
[INFO] 52°North SOS - Web Admin Controller ................ SUCCESS [  2.585 s]
[INFO] 52°North SOS - Web Install Controller .............. SUCCESS [  1.986 s]
[INFO] 52°North SOS - Web Client Controller ............... SUCCESS [  1.931 s]
[INFO] 52°North SOS - Web Views ........................... SUCCESS [ 14.903 s]
[INFO] 52°North SOS - Webapp .............................. FAILURE [ 32.930 s]
[INFO] 52°North SOS - Webapp with Sensor Web REST API ..... SKIPPED
[INFO] ------------------------------------------------------------------------
[INFO] BUILD FAILURE
[INFO] ------------------------------------------------------------------------
[INFO] Total time: 08:48 min
[INFO] Finished at: 2017-03-24T14:31:34+00:00
[INFO] Final Memory: 370M/708M
[INFO] ------------------------------------------------------------------------
[ERROR] Failed to execute goal on project webapp: Could not resolve dependencies for project org.n52.sensorweb.sos:webapp:war:4.3.11-UBA-1.0.1: The following artifacts could not be resolved: org.n52.sensorweb.sos:hibernate-datasource-oracle:jar:4.3.11-UBA-1.0.1, org.n52.sensorweb.sos:hibernate-datasource-sqlserver:jar:4.3.11-UBA-1.0.1: Could not find artifact org.n52.sensorweb.sos:hibernate-datasource-oracle:jar:4.3.11-UBA-1.0.1 in 52n-nexus (http://localhost/nexus/content/groups/public/) -> [Help 1]
[ERROR] 
[ERROR] To see the full stack trace of the errors, re-run Maven with the -e switch.
[ERROR] Re-run Maven using the -X switch to enable full debug logging.
[ERROR] 
[ERROR] For more information about the errors and possible solutions, please read the following articles:
[ERROR] [Help 1] http://cwiki.apache.org/confluence/display/MAVEN/DependencyResolutionException
[ERROR] 
[ERROR] After correcting the problems, you can resume the build with the command
[ERROR]   mvn <goals> -rf :webapp
[JENKINS] Archiving /var/lib/jenkins/workspace/deploy_SOS-UBA-mergable-series/core/test/pom.xml to org.n52.sensorweb.sos/test/4.3.11-UBA-1.0.1/test-4.3.11-UBA-1.0.1.pom
[JENKINS] Archiving /var/lib/jenkins/workspace/deploy_SOS-UBA-mergable-series/core/test/target/test-4.3.11-UBA-1.0.1.jar to org.n52.sensorweb.sos/test/4.3.11-UBA-1.0.1/test-4.3.11-UBA-1.0.1.jar
[JENKINS] Archiving /var/lib/jenkins/workspace/deploy_SOS-UBA-mergable-series/core/test/target/test-4.3.11-UBA-1.0.1-sources.jar to org.n52.sensorweb.sos/test/4.3.11-UBA-1.0.1/test-4.3.11-UBA-1.0.1-sources.jar
[JENKINS] Archiving /var/lib/jenkins/workspace/deploy_SOS-UBA-mergable-series/bindings/json/pom.xml to org.n52.sensorweb.sos/binding-json/4.3.11-UBA-1.0.1/binding-json-4.3.11-UBA-1.0.1.pom
[JENKINS] Archiving /var/lib/jenkins/workspace/deploy_SOS-UBA-mergable-series/bindings/json/target/binding-json-4.3.11-UBA-1.0.1.jar to org.n52.sensorweb.sos/binding-json/4.3.11-UBA-1.0.1/binding-json-4.3.11-UBA-1.0.1.jar
[JENKINS] Archiving /var/lib/jenkins/workspace/deploy_SOS-UBA-mergable-series/bindings/json/target/binding-json-4.3.11-UBA-1.0.1-sources.jar to org.n52.sensorweb.sos/binding-json/4.3.11-UBA-1.0.1/binding-json-4.3.11-UBA-1.0.1-sources.jar
[JENKINS] Archiving /var/lib/jenkins/workspace/deploy_SOS-UBA-mergable-series/coding/sos-v100/pom.xml to org.n52.sensorweb.sos/coding-sos-v100/4.3.11-UBA-1.0.1/coding-sos-v100-4.3.11-UBA-1.0.1.pom
[JENKINS] Archiving /var/lib/jenkins/workspace/deploy_SOS-UBA-mergable-series/coding/sos-v100/target/coding-sos-v100-4.3.11-UBA-1.0.1.jar to org.n52.sensorweb.sos/coding-sos-v100/4.3.11-UBA-1.0.1/coding-sos-v100-4.3.11-UBA-1.0.1.jar
[JENKINS] Archiving /var/lib/jenkins/workspace/deploy_SOS-UBA-mergable-series/coding/sos-v100/target/coding-sos-v100-4.3.11-UBA-1.0.1-sources.jar to org.n52.sensorweb.sos/coding-sos-v100/4.3.11-UBA-1.0.1/coding-sos-v100-4.3.11-UBA-1.0.1-sources.jar
[JENKINS] Archiving /var/lib/jenkins/workspace/deploy_SOS-UBA-mergable-series/core/cache/pom.xml to org.n52.sensorweb.sos/cache/4.3.11-UBA-1.0.1/cache-4.3.11-UBA-1.0.1.pom
[JENKINS] Archiving /var/lib/jenkins/workspace/deploy_SOS-UBA-mergable-series/core/cache/target/cache-4.3.11-UBA-1.0.1.jar to org.n52.sensorweb.sos/cache/4.3.11-UBA-1.0.1/cache-4.3.11-UBA-1.0.1.jar
[JENKINS] Archiving /var/lib/jenkins/workspace/deploy_SOS-UBA-mergable-series/core/cache/target/cache-4.3.11-UBA-1.0.1-sources.jar to org.n52.sensorweb.sos/cache/4.3.11-UBA-1.0.1/cache-4.3.11-UBA-1.0.1-sources.jar
[JENKINS] Archiving /var/lib/jenkins/workspace/deploy_SOS-UBA-mergable-series/third-party/pom.xml to org.n52.sensorweb.sos/52n-sos-third-party/4.3.11-UBA-1.0.1/52n-sos-third-party-4.3.11-UBA-1.0.1.pom
[JENKINS] Archiving /var/lib/jenkins/workspace/deploy_SOS-UBA-mergable-series/coding/wml-v20/pom.xml to org.n52.sensorweb.sos/coding-wml-v20/4.3.11-UBA-1.0.1/coding-wml-v20-4.3.11-UBA-1.0.1.pom
[JENKINS] Archiving /var/lib/jenkins/workspace/deploy_SOS-UBA-mergable-series/coding/wml-v20/target/coding-wml-v20-4.3.11-UBA-1.0.1.jar to org.n52.sensorweb.sos/coding-wml-v20/4.3.11-UBA-1.0.1/coding-wml-v20-4.3.11-UBA-1.0.1.jar
[JENKINS] Archiving /var/lib/jenkins/workspace/deploy_SOS-UBA-mergable-series/coding/wml-v20/target/coding-wml-v20-4.3.11-UBA-1.0.1-sources.jar to org.n52.sensorweb.sos/coding-wml-v20/4.3.11-UBA-1.0.1/coding-wml-v20-4.3.11-UBA-1.0.1-sources.jar
[JENKINS] Archiving /var/lib/jenkins/workspace/deploy_SOS-UBA-mergable-series/extensions/aqd/coding/pom.xml to org.n52.sensorweb.sos/coding-aqd/4.3.11-UBA-1.0.1/coding-aqd-4.3.11-UBA-1.0.1.pom
[JENKINS] Archiving /var/lib/jenkins/workspace/deploy_SOS-UBA-mergable-series/bindings/exi/pom.xml to org.n52.sensorweb.sos/binding-exi/4.3.11-UBA-1.0.1/binding-exi-4.3.11-UBA-1.0.1.pom
[JENKINS] Archiving /var/lib/jenkins/workspace/deploy_SOS-UBA-mergable-series/bindings/exi/target/binding-exi-4.3.11-UBA-1.0.1.jar to org.n52.sensorweb.sos/binding-exi/4.3.11-UBA-1.0.1/binding-exi-4.3.11-UBA-1.0.1.jar
[JENKINS] Archiving /var/lib/jenkins/workspace/deploy_SOS-UBA-mergable-series/bindings/exi/target/binding-exi-4.3.11-UBA-1.0.1-sources.jar to org.n52.sensorweb.sos/binding-exi/4.3.11-UBA-1.0.1/binding-exi-4.3.11-UBA-1.0.1-sources.jar
[JENKINS] Archiving /var/lib/jenkins/workspace/deploy_SOS-UBA-mergable-series/coding/ows-v110/pom.xml to org.n52.sensorweb.sos/coding-ows-v110/4.3.11-UBA-1.0.1/coding-ows-v110-4.3.11-UBA-1.0.1.pom
[JENKINS] Archiving /var/lib/jenkins/workspace/deploy_SOS-UBA-mergable-series/coding/ows-v110/target/coding-ows-v110-4.3.11-UBA-1.0.1.jar to org.n52.sensorweb.sos/coding-ows-v110/4.3.11-UBA-1.0.1/coding-ows-v110-4.3.11-UBA-1.0.1.jar
[JENKINS] Archiving /var/lib/jenkins/workspace/deploy_SOS-UBA-mergable-series/coding/ows-v110/target/coding-ows-v110-4.3.11-UBA-1.0.1-sources.jar to org.n52.sensorweb.sos/coding-ows-v110/4.3.11-UBA-1.0.1/coding-ows-v110-4.3.11-UBA-1.0.1-sources.jar
[JENKINS] Archiving /var/lib/jenkins/workspace/deploy_SOS-UBA-mergable-series/bindings/rest/code/pom.xml to org.n52.sensorweb.sos/rest-code/4.3.11-UBA-1.0.1/rest-code-4.3.11-UBA-1.0.1.pom
[JENKINS] Archiving /var/lib/jenkins/workspace/deploy_SOS-UBA-mergable-series/bindings/rest/code/target/rest-code-4.3.11-UBA-1.0.1.jar to org.n52.sensorweb.sos/rest-code/4.3.11-UBA-1.0.1/rest-code-4.3.11-UBA-1.0.1.jar
[JENKINS] Archiving /var/lib/jenkins/workspace/deploy_SOS-UBA-mergable-series/bindings/rest/code/target/rest-code-4.3.11-UBA-1.0.1-sources.jar to org.n52.sensorweb.sos/rest-code/4.3.11-UBA-1.0.1/rest-code-4.3.11-UBA-1.0.1-sources.jar
[JENKINS] Archiving /var/lib/jenkins/workspace/deploy_SOS-UBA-mergable-series/coding/json-common/pom.xml to org.n52.sensorweb.sos/coding-json-common/4.3.11-UBA-1.0.1/coding-json-common-4.3.11-UBA-1.0.1.pom
[JENKINS] Archiving /var/lib/jenkins/workspace/deploy_SOS-UBA-mergable-series/coding/json-common/target/coding-json-common-4.3.11-UBA-1.0.1.jar to org.n52.sensorweb.sos/coding-json-common/4.3.11-UBA-1.0.1/coding-json-common-4.3.11-UBA-1.0.1.jar
[JENKINS] Archiving /var/lib/jenkins/workspace/deploy_SOS-UBA-mergable-series/coding/json-common/target/coding-json-common-4.3.11-UBA-1.0.1-sources.jar to org.n52.sensorweb.sos/coding-json-common/4.3.11-UBA-1.0.1/coding-json-common-4.3.11-UBA-1.0.1-sources.jar
[JENKINS] Archiving /var/lib/jenkins/workspace/deploy_SOS-UBA-mergable-series/coding/json-common/target/coding-json-common-4.3.11-UBA-1.0.1-tests.jar to org.n52.sensorweb.sos/coding-json-common/4.3.11-UBA-1.0.1/coding-json-common-4.3.11-UBA-1.0.1-tests.jar
[JENKINS] Archiving /var/lib/jenkins/workspace/deploy_SOS-UBA-mergable-series/extensions/pom.xml to org.n52.sensorweb.sos/extensions/4.3.11-UBA-1.0.1/extensions-4.3.11-UBA-1.0.1.pom
[JENKINS] Archiving /var/lib/jenkins/workspace/deploy_SOS-UBA-mergable-series/bindings/rest/xml/pom.xml to org.n52.sensorweb.sos/rest-xml/4.3.11-UBA-1.0.1/rest-xml-4.3.11-UBA-1.0.1.pom
[JENKINS] Archiving /var/lib/jenkins/workspace/deploy_SOS-UBA-mergable-series/bindings/rest/xml/target/rest-xml-4.3.11-UBA-1.0.1.jar to org.n52.sensorweb.sos/rest-xml/4.3.11-UBA-1.0.1/rest-xml-4.3.11-UBA-1.0.1.jar
[JENKINS] Archiving /var/lib/jenkins/workspace/deploy_SOS-UBA-mergable-series/bindings/rest/xml/target/rest-xml-4.3.11-UBA-1.0.1-sources.jar to org.n52.sensorweb.sos/rest-xml/4.3.11-UBA-1.0.1/rest-xml-4.3.11-UBA-1.0.1-sources.jar
[JENKINS] Archiving /var/lib/jenkins/workspace/deploy_SOS-UBA-mergable-series/extensions/do/kvp/pom.xml to org.n52.sensorweb.sos/do-kvp/4.3.11-UBA-1.0.1/do-kvp-4.3.11-UBA-1.0.1.pom
[JENKINS] Archiving /var/lib/jenkins/workspace/deploy_SOS-UBA-mergable-series/extensions/do/kvp/target/do-kvp-4.3.11-UBA-1.0.1.jar to org.n52.sensorweb.sos/do-kvp/4.3.11-UBA-1.0.1/do-kvp-4.3.11-UBA-1.0.1.jar
[JENKINS] Archiving /var/lib/jenkins/workspace/deploy_SOS-UBA-mergable-series/extensions/do/kvp/target/do-kvp-4.3.11-UBA-1.0.1-sources.jar to org.n52.sensorweb.sos/do-kvp/4.3.11-UBA-1.0.1/do-kvp-4.3.11-UBA-1.0.1-sources.jar
[JENKINS] Archiving /var/lib/jenkins/workspace/deploy_SOS-UBA-mergable-series/spring/pom.xml to org.n52.sensorweb.sos/spring/4.3.11-UBA-1.0.1/spring-4.3.11-UBA-1.0.1.pom
[JENKINS] Archiving /var/lib/jenkins/workspace/deploy_SOS-UBA-mergable-series/core/profile/xml/pom.xml to org.n52.sensorweb.sos/profile-xml/4.3.11-UBA-1.0.1/profile-xml-4.3.11-UBA-1.0.1.pom
[JENKINS] Archiving /var/lib/jenkins/workspace/deploy_SOS-UBA-mergable-series/core/profile/xml/target/profile-xml-4.3.11-UBA-1.0.1.jar to org.n52.sensorweb.sos/profile-xml/4.3.11-UBA-1.0.1/profile-xml-4.3.11-UBA-1.0.1.jar
[JENKINS] Archiving /var/lib/jenkins/workspace/deploy_SOS-UBA-mergable-series/core/profile/xml/target/profile-xml-4.3.11-UBA-1.0.1-sources.jar to org.n52.sensorweb.sos/profile-xml/4.3.11-UBA-1.0.1/profile-xml-4.3.11-UBA-1.0.1-sources.jar
[JENKINS] Archiving /var/lib/jenkins/workspace/deploy_SOS-UBA-mergable-series/hibernate/feature/pom.xml to org.n52.sensorweb.sos/hibernate-feature/4.3.11-UBA-1.0.1/hibernate-feature-4.3.11-UBA-1.0.1.pom
[JENKINS] Archiving /var/lib/jenkins/workspace/deploy_SOS-UBA-mergable-series/hibernate/feature/target/hibernate-feature-4.3.11-UBA-1.0.1.jar to org.n52.sensorweb.sos/hibernate-feature/4.3.11-UBA-1.0.1/hibernate-feature-4.3.11-UBA-1.0.1.jar
[JENKINS] Archiving /var/lib/jenkins/workspace/deploy_SOS-UBA-mergable-series/hibernate/feature/target/hibernate-feature-4.3.11-UBA-1.0.1-sources.jar to org.n52.sensorweb.sos/hibernate-feature/4.3.11-UBA-1.0.1/hibernate-feature-4.3.11-UBA-1.0.1-sources.jar
[JENKINS] Archiving /var/lib/jenkins/workspace/deploy_SOS-UBA-mergable-series/third-party/third-party-ncname-resolver/pom.xml to org.n52.sensorweb.sos/third-party-ncname-resolver/4.3.11-UBA-1.0.1/third-party-ncname-resolver-4.3.11-UBA-1.0.1.pom
[JENKINS] Archiving /var/lib/jenkins/workspace/deploy_SOS-UBA-mergable-series/third-party/third-party-ncname-resolver/target/third-party-ncname-resolver-4.3.11-UBA-1.0.1.jar to org.n52.sensorweb.sos/third-party-ncname-resolver/4.3.11-UBA-1.0.1/third-party-ncname-resolver-4.3.11-UBA-1.0.1.jar
[JENKINS] Archiving /var/lib/jenkins/workspace/deploy_SOS-UBA-mergable-series/third-party/third-party-ncname-resolver/target/third-party-ncname-resolver-4.3.11-UBA-1.0.1-sources.jar to org.n52.sensorweb.sos/third-party-ncname-resolver/4.3.11-UBA-1.0.1/third-party-ncname-resolver-4.3.11-UBA-1.0.1-sources.jar
[JENKINS] Archiving /var/lib/jenkins/workspace/deploy_SOS-UBA-mergable-series/extensions/do/json/pom.xml to org.n52.sensorweb.sos/do-json/4.3.11-UBA-1.0.1/do-json-4.3.11-UBA-1.0.1.pom
[JENKINS] Archiving /var/lib/jenkins/workspace/deploy_SOS-UBA-mergable-series/extensions/do/json/target/do-json-4.3.11-UBA-1.0.1.jar to org.n52.sensorweb.sos/do-json/4.3.11-UBA-1.0.1/do-json-4.3.11-UBA-1.0.1.jar
[JENKINS] Archiving /var/lib/jenkins/workspace/deploy_SOS-UBA-mergable-series/extensions/do/json/target/do-json-4.3.11-UBA-1.0.1-sources.jar to org.n52.sensorweb.sos/do-json/4.3.11-UBA-1.0.1/do-json-4.3.11-UBA-1.0.1-sources.jar
[JENKINS] Archiving /var/lib/jenkins/workspace/deploy_SOS-UBA-mergable-series/converter/identifier-modifier/prefixed-identifier/pom.xml to org.n52.sensorweb.sos/prefixed-identifier/4.3.11-UBA-1.0.1/prefixed-identifier-4.3.11-UBA-1.0.1.pom
[JENKINS] Archiving /var/lib/jenkins/workspace/deploy_SOS-UBA-mergable-series/converter/identifier-modifier/prefixed-identifier/target/prefixed-identifier-4.3.11-UBA-1.0.1.jar to org.n52.sensorweb.sos/prefixed-identifier/4.3.11-UBA-1.0.1/prefixed-identifier-4.3.11-UBA-1.0.1.jar
[JENKINS] Archiving /var/lib/jenkins/workspace/deploy_SOS-UBA-mergable-series/converter/identifier-modifier/prefixed-identifier/target/prefixed-identifier-4.3.11-UBA-1.0.1-sources.jar to org.n52.sensorweb.sos/prefixed-identifier/4.3.11-UBA-1.0.1/prefixed-identifier-4.3.11-UBA-1.0.1-sources.jar
[JENKINS] Archiving /var/lib/jenkins/workspace/deploy_SOS-UBA-mergable-series/core/gc-dao/pom.xml to org.n52.sensorweb.sos/gc-dao/4.3.11-UBA-1.0.1/gc-dao-4.3.11-UBA-1.0.1.pom
[JENKINS] Archiving /var/lib/jenkins/workspace/deploy_SOS-UBA-mergable-series/core/gc-dao/target/gc-dao-4.3.11-UBA-1.0.1.jar to org.n52.sensorweb.sos/gc-dao/4.3.11-UBA-1.0.1/gc-dao-4.3.11-UBA-1.0.1.jar
[JENKINS] Archiving /var/lib/jenkins/workspace/deploy_SOS-UBA-mergable-series/core/gc-dao/target/gc-dao-4.3.11-UBA-1.0.1-sources.jar to org.n52.sensorweb.sos/gc-dao/4.3.11-UBA-1.0.1/gc-dao-4.3.11-UBA-1.0.1-sources.jar
[JENKINS] Archiving /var/lib/jenkins/workspace/deploy_SOS-UBA-mergable-series/converter/split-and-merge/pom.xml to org.n52.sensorweb.sos/split-and-merge/4.3.11-UBA-1.0.1/split-and-merge-4.3.11-UBA-1.0.1.pom
[JENKINS] Archiving /var/lib/jenkins/workspace/deploy_SOS-UBA-mergable-series/converter/split-and-merge/target/split-and-merge-4.3.11-UBA-1.0.1.jar to org.n52.sensorweb.sos/split-and-merge/4.3.11-UBA-1.0.1/split-and-merge-4.3.11-UBA-1.0.1.jar
[JENKINS] Archiving /var/lib/jenkins/workspace/deploy_SOS-UBA-mergable-series/converter/split-and-merge/target/split-and-merge-4.3.11-UBA-1.0.1-sources.jar to org.n52.sensorweb.sos/split-and-merge/4.3.11-UBA-1.0.1/split-and-merge-4.3.11-UBA-1.0.1-sources.jar
[JENKINS] Archiving /var/lib/jenkins/workspace/deploy_SOS-UBA-mergable-series/extensions/do/xml/pom.xml to org.n52.sensorweb.sos/do-xml/4.3.11-UBA-1.0.1/do-xml-4.3.11-UBA-1.0.1.pom
[JENKINS] Archiving /var/lib/jenkins/workspace/deploy_SOS-UBA-mergable-series/extensions/do/xml/target/do-xml-4.3.11-UBA-1.0.1.jar to org.n52.sensorweb.sos/do-xml/4.3.11-UBA-1.0.1/do-xml-4.3.11-UBA-1.0.1.jar
[JENKINS] Archiving /var/lib/jenkins/workspace/deploy_SOS-UBA-mergable-series/extensions/do/xml/target/do-xml-4.3.11-UBA-1.0.1-sources.jar to org.n52.sensorweb.sos/do-xml/4.3.11-UBA-1.0.1/do-xml-4.3.11-UBA-1.0.1-sources.jar
[JENKINS] Archiving /var/lib/jenkins/workspace/deploy_SOS-UBA-mergable-series/webapp-bundle/pom.xml to org.n52.sensorweb.sos/webapp-bundle/4.3.11-UBA-1.0.1/webapp-bundle-4.3.11-UBA-1.0.1.pom
[JENKINS] Archiving /var/lib/jenkins/workspace/deploy_SOS-UBA-mergable-series/core/profile/coding/pom.xml to org.n52.sensorweb.sos/profile-coding/4.3.11-UBA-1.0.1/profile-coding-4.3.11-UBA-1.0.1.pom
[JENKINS] Archiving /var/lib/jenkins/workspace/deploy_SOS-UBA-mergable-series/core/profile/coding/target/profile-coding-4.3.11-UBA-1.0.1.jar to org.n52.sensorweb.sos/profile-coding/4.3.11-UBA-1.0.1/profile-coding-4.3.11-UBA-1.0.1.jar
[JENKINS] Archiving /var/lib/jenkins/workspace/deploy_SOS-UBA-mergable-series/core/profile/coding/target/profile-coding-4.3.11-UBA-1.0.1-sources.jar to org.n52.sensorweb.sos/profile-coding/4.3.11-UBA-1.0.1/profile-coding-4.3.11-UBA-1.0.1-sources.jar
[JENKINS] Archiving /var/lib/jenkins/workspace/deploy_SOS-UBA-mergable-series/bindings/soap/pom.xml to org.n52.sensorweb.sos/binding-soap/4.3.11-UBA-1.0.1/binding-soap-4.3.11-UBA-1.0.1.pom
[JENKINS] Archiving /var/lib/jenkins/workspace/deploy_SOS-UBA-mergable-series/bindings/soap/target/binding-soap-4.3.11-UBA-1.0.1.jar to org.n52.sensorweb.sos/binding-soap/4.3.11-UBA-1.0.1/binding-soap-4.3.11-UBA-1.0.1.jar
[JENKINS] Archiving /var/lib/jenkins/workspace/deploy_SOS-UBA-mergable-series/bindings/soap/target/binding-soap-4.3.11-UBA-1.0.1-sources.jar to org.n52.sensorweb.sos/binding-soap/4.3.11-UBA-1.0.1/binding-soap-4.3.11-UBA-1.0.1-sources.jar
[JENKINS] Archiving /var/lib/jenkins/workspace/deploy_SOS-UBA-mergable-series/spring/views/pom.xml to org.n52.sensorweb.sos/views/4.3.11-UBA-1.0.1/views-4.3.11-UBA-1.0.1.pom
[JENKINS] Archiving /var/lib/jenkins/workspace/deploy_SOS-UBA-mergable-series/spring/views/target/views-4.3.11-UBA-1.0.1.war to org.n52.sensorweb.sos/views/4.3.11-UBA-1.0.1/views-4.3.11-UBA-1.0.1.war
[JENKINS] Archiving /var/lib/jenkins/workspace/deploy_SOS-UBA-mergable-series/webapp/pom.xml to org.n52.sensorweb.sos/webapp/4.3.11-UBA-1.0.1/webapp-4.3.11-UBA-1.0.1.pom
[JENKINS] Archiving /var/lib/jenkins/workspace/deploy_SOS-UBA-mergable-series/hibernate/datasource/sqlserver/pom.xml to org.n52.sensorweb.sos/hibernate-datasource-sqlserver/4.3.11-UBA-1.0.0-SNAPSHOT/hibernate-datasource-sqlserver-4.3.11-UBA-1.0.0-SNAPSHOT.pom
[JENKINS] Archiving /var/lib/jenkins/workspace/deploy_SOS-UBA-mergable-series/hibernate/datasource/sqlserver/target/hibernate-datasource-sqlserver-4.3.11-UBA-1.0.0-SNAPSHOT.jar to org.n52.sensorweb.sos/hibernate-datasource-sqlserver/4.3.11-UBA-1.0.0-20170324.142951-9/hibernate-datasource-sqlserver-4.3.11-UBA-1.0.0-20170324.142951-9.jar
[JENKINS] Archiving /var/lib/jenkins/workspace/deploy_SOS-UBA-mergable-series/hibernate/datasource/sqlserver/target/hibernate-datasource-sqlserver-4.3.11-UBA-1.0.0-SNAPSHOT-sources.jar to org.n52.sensorweb.sos/hibernate-datasource-sqlserver/4.3.11-UBA-1.0.0-20170324.142951-9/hibernate-datasource-sqlserver-4.3.11-UBA-1.0.0-20170324.142951-9-sources.jar
[JENKINS] Archiving /var/lib/jenkins/workspace/deploy_SOS-UBA-mergable-series/converter/identifier-modifier/abstract-identifier/pom.xml to org.n52.sensorweb.sos/abstract-identifier/4.3.11-UBA-1.0.1/abstract-identifier-4.3.11-UBA-1.0.1.pom
[JENKINS] Archiving /var/lib/jenkins/workspace/deploy_SOS-UBA-mergable-series/converter/identifier-modifier/abstract-identifier/target/abstract-identifier-4.3.11-UBA-1.0.1.jar to org.n52.sensorweb.sos/abstract-identifier/4.3.11-UBA-1.0.1/abstract-identifier-4.3.11-UBA-1.0.1.jar
[JENKINS] Archiving /var/lib/jenkins/workspace/deploy_SOS-UBA-mergable-series/converter/identifier-modifier/abstract-identifier/target/abstract-identifier-4.3.11-UBA-1.0.1-sources.jar to org.n52.sensorweb.sos/abstract-identifier/4.3.11-UBA-1.0.1/abstract-identifier-4.3.11-UBA-1.0.1-sources.jar
[JENKINS] Archiving /var/lib/jenkins/workspace/deploy_SOS-UBA-mergable-series/hibernate/datasource/pom.xml to org.n52.sensorweb.sos/hibernate-datasource/4.3.11-UBA-1.0.1/hibernate-datasource-4.3.11-UBA-1.0.1.pom
[JENKINS] Archiving /var/lib/jenkins/workspace/deploy_SOS-UBA-mergable-series/extensions/do/hibernate/pom.xml to org.n52.sensorweb.sos/do-hibernate/4.3.11-UBA-1.0.1/do-hibernate-4.3.11-UBA-1.0.1.pom
[JENKINS] Archiving /var/lib/jenkins/workspace/deploy_SOS-UBA-mergable-series/extensions/do/hibernate/target/do-hibernate-4.3.11-UBA-1.0.1.jar to org.n52.sensorweb.sos/do-hibernate/4.3.11-UBA-1.0.1/do-hibernate-4.3.11-UBA-1.0.1.jar
[JENKINS] Archiving /var/lib/jenkins/workspace/deploy_SOS-UBA-mergable-series/extensions/do/hibernate/target/do-hibernate-4.3.11-UBA-1.0.1-sources.jar to org.n52.sensorweb.sos/do-hibernate/4.3.11-UBA-1.0.1/do-hibernate-4.3.11-UBA-1.0.1-sources.jar
[JENKINS] Archiving /var/lib/jenkins/workspace/deploy_SOS-UBA-mergable-series/hibernate/h2/pom.xml to org.n52.sensorweb.sos/hibernate-h2/4.3.11-UBA-1.0.1/hibernate-h2-4.3.11-UBA-1.0.1.pom
[JENKINS] Archiving /var/lib/jenkins/workspace/deploy_SOS-UBA-mergable-series/hibernate/h2/target/hibernate-h2-4.3.11-UBA-1.0.1.jar to org.n52.sensorweb.sos/hibernate-h2/4.3.11-UBA-1.0.1/hibernate-h2-4.3.11-UBA-1.0.1.jar
[JENKINS] Archiving /var/lib/jenkins/workspace/deploy_SOS-UBA-mergable-series/hibernate/h2/target/hibernate-h2-4.3.11-UBA-1.0.1-sources.jar to org.n52.sensorweb.sos/hibernate-h2/4.3.11-UBA-1.0.1/hibernate-h2-4.3.11-UBA-1.0.1-sources.jar
[JENKINS] Archiving /var/lib/jenkins/workspace/deploy_SOS-UBA-mergable-series/bindings/pom.xml to org.n52.sensorweb.sos/bindings/4.3.11-UBA-1.0.1/bindings-4.3.11-UBA-1.0.1.pom
[JENKINS] Archiving /var/lib/jenkins/workspace/deploy_SOS-UBA-mergable-series/coding/exi/pom.xml to org.n52.sensorweb.sos/coding-exi/4.3.11-UBA-1.0.1/coding-exi-4.3.11-UBA-1.0.1.pom
[JENKINS] Archiving /var/lib/jenkins/workspace/deploy_SOS-UBA-mergable-series/coding/exi/target/coding-exi-4.3.11-UBA-1.0.1.jar to org.n52.sensorweb.sos/coding-exi/4.3.11-UBA-1.0.1/coding-exi-4.3.11-UBA-1.0.1.jar
[JENKINS] Archiving /var/lib/jenkins/workspace/deploy_SOS-UBA-mergable-series/coding/exi/target/coding-exi-4.3.11-UBA-1.0.1-sources.jar to org.n52.sensorweb.sos/coding-exi/4.3.11-UBA-1.0.1/coding-exi-4.3.11-UBA-1.0.1-sources.jar
[JENKINS] Archiving /var/lib/jenkins/workspace/deploy_SOS-UBA-mergable-series/coding/sensorML/pom.xml to org.n52.sensorweb.sos/coding-sensorML/4.3.11-UBA-1.0.1/coding-sensorML-4.3.11-UBA-1.0.1.pom
[JENKINS] Archiving /var/lib/jenkins/workspace/deploy_SOS-UBA-mergable-series/coding/sensorML/target/coding-sensorML-4.3.11-UBA-1.0.1.jar to org.n52.sensorweb.sos/coding-sensorML/4.3.11-UBA-1.0.1/coding-sensorML-4.3.11-UBA-1.0.1.jar
[JENKINS] Archiving /var/lib/jenkins/workspace/deploy_SOS-UBA-mergable-series/coding/sensorML/target/coding-sensorML-4.3.11-UBA-1.0.1-sources.jar to org.n52.sensorweb.sos/coding-sensorML/4.3.11-UBA-1.0.1/coding-sensorML-4.3.11-UBA-1.0.1-sources.jar
[JENKINS] Archiving /var/lib/jenkins/workspace/deploy_SOS-UBA-mergable-series/extensions/aqd/operation/pom.xml to org.n52.sensorweb.sos/core-aqd-v10/4.3.11-UBA-1.0.1/core-aqd-v10-4.3.11-UBA-1.0.1.pom
[JENKINS] Archiving /var/lib/jenkins/workspace/deploy_SOS-UBA-mergable-series/extensions/aqd/operation/target/core-aqd-v10-4.3.11-UBA-1.0.1.jar to org.n52.sensorweb.sos/core-aqd-v10/4.3.11-UBA-1.0.1/core-aqd-v10-4.3.11-UBA-1.0.1.jar
[JENKINS] Archiving /var/lib/jenkins/workspace/deploy_SOS-UBA-mergable-series/extensions/aqd/operation/target/core-aqd-v10-4.3.11-UBA-1.0.1-sources.jar to org.n52.sensorweb.sos/core-aqd-v10/4.3.11-UBA-1.0.1/core-aqd-v10-4.3.11-UBA-1.0.1-sources.jar
[JENKINS] Archiving /var/lib/jenkins/workspace/deploy_SOS-UBA-mergable-series/operations/core-v20/pom.xml to org.n52.sensorweb.sos/core-v20/4.3.11-UBA-1.0.1/core-v20-4.3.11-UBA-1.0.1.pom
[JENKINS] Archiving /var/lib/jenkins/workspace/deploy_SOS-UBA-mergable-series/operations/core-v20/target/core-v20-4.3.11-UBA-1.0.1.jar to org.n52.sensorweb.sos/core-v20/4.3.11-UBA-1.0.1/core-v20-4.3.11-UBA-1.0.1.jar
[JENKINS] Archiving /var/lib/jenkins/workspace/deploy_SOS-UBA-mergable-series/operations/core-v20/target/core-v20-4.3.11-UBA-1.0.1-sources.jar to org.n52.sensorweb.sos/core-v20/4.3.11-UBA-1.0.1/core-v20-4.3.11-UBA-1.0.1-sources.jar
[JENKINS] Archiving /var/lib/jenkins/workspace/deploy_SOS-UBA-mergable-series/bindings/kvp/pom.xml to org.n52.sensorweb.sos/binding-kvp/4.3.11-UBA-1.0.1/binding-kvp-4.3.11-UBA-1.0.1.pom
[JENKINS] Archiving /var/lib/jenkins/workspace/deploy_SOS-UBA-mergable-series/bindings/kvp/target/binding-kvp-4.3.11-UBA-1.0.1.jar to org.n52.sensorweb.sos/binding-kvp/4.3.11-UBA-1.0.1/binding-kvp-4.3.11-UBA-1.0.1.jar
[JENKINS] Archiving /var/lib/jenkins/workspace/deploy_SOS-UBA-mergable-series/bindings/kvp/target/binding-kvp-4.3.11-UBA-1.0.1-sources.jar to org.n52.sensorweb.sos/binding-kvp/4.3.11-UBA-1.0.1/binding-kvp-4.3.11-UBA-1.0.1-sources.jar
[JENKINS] Archiving /var/lib/jenkins/workspace/deploy_SOS-UBA-mergable-series/extensions/inspire/pom.xml to org.n52.sensorweb.sos/inspire/4.3.11-UBA-1.0.1/inspire-4.3.11-UBA-1.0.1.pom
[JENKINS] Archiving /var/lib/jenkins/workspace/deploy_SOS-UBA-mergable-series/spring/admin-controller/pom.xml to org.n52.sensorweb.sos/admin-controller/4.3.11-UBA-1.0.1/admin-controller-4.3.11-UBA-1.0.1.pom
[JENKINS] Archiving /var/lib/jenkins/workspace/deploy_SOS-UBA-mergable-series/spring/admin-controller/target/admin-controller-4.3.11-UBA-1.0.1.jar to org.n52.sensorweb.sos/admin-controller/4.3.11-UBA-1.0.1/admin-controller-4.3.11-UBA-1.0.1.jar
[JENKINS] Archiving /var/lib/jenkins/workspace/deploy_SOS-UBA-mergable-series/spring/admin-controller/target/admin-controller-4.3.11-UBA-1.0.1-sources.jar to org.n52.sensorweb.sos/admin-controller/4.3.11-UBA-1.0.1/admin-controller-4.3.11-UBA-1.0.1-sources.jar
[JENKINS] Archiving /var/lib/jenkins/workspace/deploy_SOS-UBA-mergable-series/extensions/aqd/ereporting-identifier/pom.xml to org.n52.sensorweb.sos/ereporting-identifier/4.3.11-UBA-1.0.1/ereporting-identifier-4.3.11-UBA-1.0.1.pom
[JENKINS] Archiving /var/lib/jenkins/workspace/deploy_SOS-UBA-mergable-series/extensions/aqd/ereporting-identifier/target/ereporting-identifier-4.3.11-UBA-1.0.1.jar to org.n52.sensorweb.sos/ereporting-identifier/4.3.11-UBA-1.0.1/ereporting-identifier-4.3.11-UBA-1.0.1.jar
[JENKINS] Archiving /var/lib/jenkins/workspace/deploy_SOS-UBA-mergable-series/extensions/aqd/ereporting-identifier/target/ereporting-identifier-4.3.11-UBA-1.0.1-sources.jar to org.n52.sensorweb.sos/ereporting-identifier/4.3.11-UBA-1.0.1/ereporting-identifier-4.3.11-UBA-1.0.1-sources.jar
[JENKINS] Archiving /var/lib/jenkins/workspace/deploy_SOS-UBA-mergable-series/core/sqlite-config/pom.xml to org.n52.sensorweb.sos/sqlite-config/4.3.11-UBA-1.0.1/sqlite-config-4.3.11-UBA-1.0.1.pom
[JENKINS] Archiving /var/lib/jenkins/workspace/deploy_SOS-UBA-mergable-series/core/sqlite-config/target/sqlite-config-4.3.11-UBA-1.0.1.jar to org.n52.sensorweb.sos/sqlite-config/4.3.11-UBA-1.0.1/sqlite-config-4.3.11-UBA-1.0.1.jar
[JENKINS] Archiving /var/lib/jenkins/workspace/deploy_SOS-UBA-mergable-series/core/sqlite-config/target/sqlite-config-4.3.11-UBA-1.0.1-sources.jar to org.n52.sensorweb.sos/sqlite-config/4.3.11-UBA-1.0.1/sqlite-config-4.3.11-UBA-1.0.1-sources.jar
[JENKINS] Archiving /var/lib/jenkins/workspace/deploy_SOS-UBA-mergable-series/core/sqlite-config/target/sqlite-config-4.3.11-UBA-1.0.1-tests.jar to org.n52.sensorweb.sos/sqlite-config/4.3.11-UBA-1.0.1/sqlite-config-4.3.11-UBA-1.0.1-tests.jar
[JENKINS] Archiving /var/lib/jenkins/workspace/deploy_SOS-UBA-mergable-series/extensions/aqd/split-and-merge/pom.xml to org.n52.sensorweb.sos/aqd-split-and-merge/4.3.11-UBA-1.0.1/aqd-split-and-merge-4.3.11-UBA-1.0.1.pom
[JENKINS] Archiving /var/lib/jenkins/workspace/deploy_SOS-UBA-mergable-series/extensions/aqd/split-and-merge/target/aqd-split-and-merge-4.3.11-UBA-1.0.1.jar to org.n52.sensorweb.sos/aqd-split-and-merge/4.3.11-UBA-1.0.1/aqd-split-and-merge-4.3.11-UBA-1.0.1.jar
[JENKINS] Archiving /var/lib/jenkins/workspace/deploy_SOS-UBA-mergable-series/extensions/aqd/split-and-merge/target/aqd-split-and-merge-4.3.11-UBA-1.0.1-sources.jar to org.n52.sensorweb.sos/aqd-split-and-merge/4.3.11-UBA-1.0.1/aqd-split-and-merge-4.3.11-UBA-1.0.1-sources.jar
[JENKINS] Archiving /var/lib/jenkins/workspace/deploy_SOS-UBA-mergable-series/converter/transformation/coordinate/pom.xml to org.n52.sensorweb.sos/request-response-coordinate-transformer/4.3.11-UBA-1.0.1/request-response-coordinate-transformer-4.3.11-UBA-1.0.1.pom
[JENKINS] Archiving /var/lib/jenkins/workspace/deploy_SOS-UBA-mergable-series/converter/transformation/coordinate/target/request-response-coordinate-transformer-4.3.11-UBA-1.0.1.jar to org.n52.sensorweb.sos/request-response-coordinate-transformer/4.3.11-UBA-1.0.1/request-response-coordinate-transformer-4.3.11-UBA-1.0.1.jar
[JENKINS] Archiving /var/lib/jenkins/workspace/deploy_SOS-UBA-mergable-series/converter/transformation/coordinate/target/request-response-coordinate-transformer-4.3.11-UBA-1.0.1-sources.jar to org.n52.sensorweb.sos/request-response-coordinate-transformer/4.3.11-UBA-1.0.1/request-response-coordinate-transformer-4.3.11-UBA-1.0.1-sources.jar
[JENKINS] Archiving /var/lib/jenkins/workspace/deploy_SOS-UBA-mergable-series/operations/resultHandling-v20/pom.xml to org.n52.sensorweb.sos/resultHandling-v20/4.3.11-UBA-1.0.1/resultHandling-v20-4.3.11-UBA-1.0.1.pom
[JENKINS] Archiving /var/lib/jenkins/workspace/deploy_SOS-UBA-mergable-series/operations/resultHandling-v20/target/resultHandling-v20-4.3.11-UBA-1.0.1.jar to org.n52.sensorweb.sos/resultHandling-v20/4.3.11-UBA-1.0.1/resultHandling-v20-4.3.11-UBA-1.0.1.jar
[JENKINS] Archiving /var/lib/jenkins/workspace/deploy_SOS-UBA-mergable-series/operations/resultHandling-v20/target/resultHandling-v20-4.3.11-UBA-1.0.1-sources.jar to org.n52.sensorweb.sos/resultHandling-v20/4.3.11-UBA-1.0.1/resultHandling-v20-4.3.11-UBA-1.0.1-sources.jar
[JENKINS] Archiving /var/lib/jenkins/workspace/deploy_SOS-UBA-mergable-series/extensions/do/pom.xml to org.n52.sensorweb.sos/do/4.3.11-UBA-1.0.1/do-4.3.11-UBA-1.0.1.pom
[JENKINS] Archiving /var/lib/jenkins/workspace/deploy_SOS-UBA-mergable-series/bindings/rest/pom.xml to org.n52.sensorweb.sos/rest/4.3.11-UBA-1.0.1/rest-4.3.11-UBA-1.0.1.pom
[JENKINS] Archiving /var/lib/jenkins/workspace/deploy_SOS-UBA-mergable-series/extensions/do/core/pom.xml to org.n52.sensorweb.sos/do-core/4.3.11-UBA-1.0.1/do-core-4.3.11-UBA-1.0.1.pom
[JENKINS] Archiving /var/lib/jenkins/workspace/deploy_SOS-UBA-mergable-series/extensions/do/core/target/do-core-4.3.11-UBA-1.0.1.jar to org.n52.sensorweb.sos/do-core/4.3.11-UBA-1.0.1/do-core-4.3.11-UBA-1.0.1.jar
[JENKINS] Archiving /var/lib/jenkins/workspace/deploy_SOS-UBA-mergable-series/extensions/do/core/target/do-core-4.3.11-UBA-1.0.1-sources.jar to org.n52.sensorweb.sos/do-core/4.3.11-UBA-1.0.1/do-core-4.3.11-UBA-1.0.1-sources.jar
[JENKINS] Archiving /var/lib/jenkins/workspace/deploy_SOS-UBA-mergable-series/hibernate/datasource/common/pom.xml to org.n52.sensorweb.sos/hibernate-datasource-common/4.3.11-UBA-1.0.1/hibernate-datasource-common-4.3.11-UBA-1.0.1.pom
[JENKINS] Archiving /var/lib/jenkins/workspace/deploy_SOS-UBA-mergable-series/hibernate/datasource/common/target/hibernate-datasource-common-4.3.11-UBA-1.0.1.jar to org.n52.sensorweb.sos/hibernate-datasource-common/4.3.11-UBA-1.0.1/hibernate-datasource-common-4.3.11-UBA-1.0.1.jar
[JENKINS] Archiving /var/lib/jenkins/workspace/deploy_SOS-UBA-mergable-series/hibernate/datasource/common/target/hibernate-datasource-common-4.3.11-UBA-1.0.1-sources.jar to org.n52.sensorweb.sos/hibernate-datasource-common/4.3.11-UBA-1.0.1/hibernate-datasource-common-4.3.11-UBA-1.0.1-sources.jar
[JENKINS] Archiving /var/lib/jenkins/workspace/deploy_SOS-UBA-mergable-series/spring/common-controller/pom.xml to org.n52.sensorweb.sos/common-controller/4.3.11-UBA-1.0.1/common-controller-4.3.11-UBA-1.0.1.pom
[JENKINS] Archiving /var/lib/jenkins/workspace/deploy_SOS-UBA-mergable-series/spring/common-controller/target/common-controller-4.3.11-UBA-1.0.1.jar to org.n52.sensorweb.sos/common-controller/4.3.11-UBA-1.0.1/common-controller-4.3.11-UBA-1.0.1.jar
[JENKINS] Archiving /var/lib/jenkins/workspace/deploy_SOS-UBA-mergable-series/spring/common-controller/target/common-controller-4.3.11-UBA-1.0.1-sources.jar to org.n52.sensorweb.sos/common-controller/4.3.11-UBA-1.0.1/common-controller-4.3.11-UBA-1.0.1-sources.jar
[JENKINS] Archiving /var/lib/jenkins/workspace/deploy_SOS-UBA-mergable-series/core/profile/pom.xml to org.n52.sensorweb.sos/profile/4.3.11-UBA-1.0.1/profile-4.3.11-UBA-1.0.1.pom
[JENKINS] Archiving /var/lib/jenkins/workspace/deploy_SOS-UBA-mergable-series/extensions/gda/pom.xml to org.n52.sensorweb.sos/gda/4.3.11-UBA-1.0.1/gda-4.3.11-UBA-1.0.1.pom
[JENKINS] Archiving /var/lib/jenkins/workspace/deploy_SOS-UBA-mergable-series/extensions/gda/hibernate/pom.xml to org.n52.sensorweb.sos/gda-hibernate/4.3.11-UBA-1.0.1/gda-hibernate-4.3.11-UBA-1.0.1.pom
[JENKINS] Archiving /var/lib/jenkins/workspace/deploy_SOS-UBA-mergable-series/extensions/gda/hibernate/target/gda-hibernate-4.3.11-UBA-1.0.1.jar to org.n52.sensorweb.sos/gda-hibernate/4.3.11-UBA-1.0.1/gda-hibernate-4.3.11-UBA-1.0.1.jar
[JENKINS] Archiving /var/lib/jenkins/workspace/deploy_SOS-UBA-mergable-series/extensions/gda/hibernate/target/gda-hibernate-4.3.11-UBA-1.0.1-sources.jar to org.n52.sensorweb.sos/gda-hibernate/4.3.11-UBA-1.0.1/gda-hibernate-4.3.11-UBA-1.0.1-sources.jar
[JENKINS] Archiving /var/lib/jenkins/workspace/deploy_SOS-UBA-mergable-series/spring/client-controller/pom.xml to org.n52.sensorweb.sos/client-controller/4.3.11-UBA-1.0.1/client-controller-4.3.11-UBA-1.0.1.pom
[JENKINS] Archiving /var/lib/jenkins/workspace/deploy_SOS-UBA-mergable-series/spring/client-controller/target/client-controller-4.3.11-UBA-1.0.1.jar to org.n52.sensorweb.sos/client-controller/4.3.11-UBA-1.0.1/client-controller-4.3.11-UBA-1.0.1.jar
[JENKINS] Archiving /var/lib/jenkins/workspace/deploy_SOS-UBA-mergable-series/spring/client-controller/target/client-controller-4.3.11-UBA-1.0.1-sources.jar to org.n52.sensorweb.sos/client-controller/4.3.11-UBA-1.0.1/client-controller-4.3.11-UBA-1.0.1-sources.jar
[JENKINS] Archiving /var/lib/jenkins/workspace/deploy_SOS-UBA-mergable-series/hibernate/datasource/oracle/pom.xml to org.n52.sensorweb.sos/hibernate-datasource-oracle/4.3.11-UBA-1.0.0-SNAPSHOT/hibernate-datasource-oracle-4.3.11-UBA-1.0.0-SNAPSHOT.pom
[JENKINS] Archiving /var/lib/jenkins/workspace/deploy_SOS-UBA-mergable-series/hibernate/datasource/oracle/target/hibernate-datasource-oracle-4.3.11-UBA-1.0.0-SNAPSHOT.jar to org.n52.sensorweb.sos/hibernate-datasource-oracle/4.3.11-UBA-1.0.0-20170324.142945-9/hibernate-datasource-oracle-4.3.11-UBA-1.0.0-20170324.142945-9.jar
[JENKINS] Archiving /var/lib/jenkins/workspace/deploy_SOS-UBA-mergable-series/hibernate/datasource/oracle/target/hibernate-datasource-oracle-4.3.11-UBA-1.0.0-SNAPSHOT-sources.jar to org.n52.sensorweb.sos/hibernate-datasource-oracle/4.3.11-UBA-1.0.0-20170324.142945-9/hibernate-datasource-oracle-4.3.11-UBA-1.0.0-20170324.142945-9-sources.jar
[JENKINS] Archiving /var/lib/jenkins/workspace/deploy_SOS-UBA-mergable-series/pom.xml to org.n52.sensorweb.sos/52n-sos/4.3.11-UBA-1.0.1/52n-sos-4.3.11-UBA-1.0.1.pom
[JENKINS] Archiving /var/lib/jenkins/workspace/deploy_SOS-UBA-mergable-series/bindings/pox/pom.xml to org.n52.sensorweb.sos/binding-pox/4.3.11-UBA-1.0.1/binding-pox-4.3.11-UBA-1.0.1.pom
[JENKINS] Archiving /var/lib/jenkins/workspace/deploy_SOS-UBA-mergable-series/bindings/pox/target/binding-pox-4.3.11-UBA-1.0.1.jar to org.n52.sensorweb.sos/binding-pox/4.3.11-UBA-1.0.1/binding-pox-4.3.11-UBA-1.0.1.jar
[JENKINS] Archiving /var/lib/jenkins/workspace/deploy_SOS-UBA-mergable-series/bindings/pox/target/binding-pox-4.3.11-UBA-1.0.1-sources.jar to org.n52.sensorweb.sos/binding-pox/4.3.11-UBA-1.0.1/binding-pox-4.3.11-UBA-1.0.1-sources.jar
[JENKINS] Archiving /var/lib/jenkins/workspace/deploy_SOS-UBA-mergable-series/core/api/pom.xml to org.n52.sensorweb.sos/api/4.3.11-UBA-1.0.1/api-4.3.11-UBA-1.0.1.pom
[JENKINS] Archiving /var/lib/jenkins/workspace/deploy_SOS-UBA-mergable-series/core/api/target/api-4.3.11-UBA-1.0.1.jar to org.n52.sensorweb.sos/api/4.3.11-UBA-1.0.1/api-4.3.11-UBA-1.0.1.jar
[JENKINS] Archiving /var/lib/jenkins/workspace/deploy_SOS-UBA-mergable-series/core/api/target/api-4.3.11-UBA-1.0.1-sources.jar to org.n52.sensorweb.sos/api/4.3.11-UBA-1.0.1/api-4.3.11-UBA-1.0.1-sources.jar
[JENKINS] Archiving /var/lib/jenkins/workspace/deploy_SOS-UBA-mergable-series/core/api/target/api-4.3.11-UBA-1.0.1-tests.jar to org.n52.sensorweb.sos/api/4.3.11-UBA-1.0.1/api-4.3.11-UBA-1.0.1-tests.jar
[JENKINS] Archiving /var/lib/jenkins/workspace/deploy_SOS-UBA-mergable-series/hibernate/session-factory/pom.xml to org.n52.sensorweb.sos/hibernate-session-factory/4.3.11-UBA-1.0.1/hibernate-session-factory-4.3.11-UBA-1.0.1.pom
[JENKINS] Archiving /var/lib/jenkins/workspace/deploy_SOS-UBA-mergable-series/hibernate/session-factory/target/hibernate-session-factory-4.3.11-UBA-1.0.1.jar to org.n52.sensorweb.sos/hibernate-session-factory/4.3.11-UBA-1.0.1/hibernate-session-factory-4.3.11-UBA-1.0.1.jar
[JENKINS] Archiving /var/lib/jenkins/workspace/deploy_SOS-UBA-mergable-series/hibernate/session-factory/target/hibernate-session-factory-4.3.11-UBA-1.0.1-sources.jar to org.n52.sensorweb.sos/hibernate-session-factory/4.3.11-UBA-1.0.1/hibernate-session-factory-4.3.11-UBA-1.0.1-sources.jar
[JENKINS] Archiving /var/lib/jenkins/workspace/deploy_SOS-UBA-mergable-series/converter/identifier-modifier/flexible-identifier/pom.xml to org.n52.sensorweb.sos/flexible-identifier/4.3.11-UBA-1.0.1/flexible-identifier-4.3.11-UBA-1.0.1.pom
[JENKINS] Archiving /var/lib/jenkins/workspace/deploy_SOS-UBA-mergable-series/converter/identifier-modifier/flexible-identifier/target/flexible-identifier-4.3.11-UBA-1.0.1.jar to org.n52.sensorweb.sos/flexible-identifier/4.3.11-UBA-1.0.1/flexible-identifier-4.3.11-UBA-1.0.1.jar
[JENKINS] Archiving /var/lib/jenkins/workspace/deploy_SOS-UBA-mergable-series/converter/identifier-modifier/flexible-identifier/target/flexible-identifier-4.3.11-UBA-1.0.1-sources.jar to org.n52.sensorweb.sos/flexible-identifier/4.3.11-UBA-1.0.1/flexible-identifier-4.3.11-UBA-1.0.1-sources.jar
[JENKINS] Archiving /var/lib/jenkins/workspace/deploy_SOS-UBA-mergable-series/coding/json/pom.xml to org.n52.sensorweb.sos/coding-json/4.3.11-UBA-1.0.1/coding-json-4.3.11-UBA-1.0.1.pom
[JENKINS] Archiving /var/lib/jenkins/workspace/deploy_SOS-UBA-mergable-series/coding/json/target/coding-json-4.3.11-UBA-1.0.1.jar to org.n52.sensorweb.sos/coding-json/4.3.11-UBA-1.0.1/coding-json-4.3.11-UBA-1.0.1.jar
[JENKINS] Archiving /var/lib/jenkins/workspace/deploy_SOS-UBA-mergable-series/coding/json/target/coding-json-4.3.11-UBA-1.0.1-sources.jar to org.n52.sensorweb.sos/coding-json/4.3.11-UBA-1.0.1/coding-json-4.3.11-UBA-1.0.1-sources.jar
[JENKINS] Archiving /var/lib/jenkins/workspace/deploy_SOS-UBA-mergable-series/hibernate/mappings/pom.xml to org.n52.sensorweb.sos/hibernate-mappings/4.3.11-UBA-1.0.1/hibernate-mappings-4.3.11-UBA-1.0.1.pom
[JENKINS] Archiving /var/lib/jenkins/workspace/deploy_SOS-UBA-mergable-series/hibernate/mappings/target/hibernate-mappings-4.3.11-UBA-1.0.1.jar to org.n52.sensorweb.sos/hibernate-mappings/4.3.11-UBA-1.0.1/hibernate-mappings-4.3.11-UBA-1.0.1.jar
[JENKINS] Archiving /var/lib/jenkins/workspace/deploy_SOS-UBA-mergable-series/hibernate/mappings/target/hibernate-mappings-4.3.11-UBA-1.0.1-sources.jar to org.n52.sensorweb.sos/hibernate-mappings/4.3.11-UBA-1.0.1/hibernate-mappings-4.3.11-UBA-1.0.1-sources.jar
[JENKINS] Archiving /var/lib/jenkins/workspace/deploy_SOS-UBA-mergable-series/extensions/aqd/api/pom.xml to org.n52.sensorweb.sos/api-aqd-v10/4.3.11-UBA-1.0.1/api-aqd-v10-4.3.11-UBA-1.0.1.pom
[JENKINS] Archiving /var/lib/jenkins/workspace/deploy_SOS-UBA-mergable-series/extensions/aqd/api/target/api-aqd-v10-4.3.11-UBA-1.0.1.jar to org.n52.sensorweb.sos/api-aqd-v10/4.3.11-UBA-1.0.1/api-aqd-v10-4.3.11-UBA-1.0.1.jar
[JENKINS] Archiving /var/lib/jenkins/workspace/deploy_SOS-UBA-mergable-series/extensions/aqd/api/target/api-aqd-v10-4.3.11-UBA-1.0.1-sources.jar to org.n52.sensorweb.sos/api-aqd-v10/4.3.11-UBA-1.0.1/api-aqd-v10-4.3.11-UBA-1.0.1-sources.jar
[JENKINS] Archiving /var/lib/jenkins/workspace/deploy_SOS-UBA-mergable-series/extensions/aqd/pom.xml to org.n52.sensorweb.sos/aqd/4.3.11-UBA-1.0.1/aqd-4.3.11-UBA-1.0.1.pom
[JENKINS] Archiving /var/lib/jenkins/workspace/deploy_SOS-UBA-mergable-series/coding/pom.xml to org.n52.sensorweb.sos/coding/4.3.11-UBA-1.0.1/coding-4.3.11-UBA-1.0.1.pom
[JENKINS] Archiving /var/lib/jenkins/workspace/deploy_SOS-UBA-mergable-series/coding/sensorML-v101/pom.xml to org.n52.sensorweb.sos/coding-sensorML-v101/4.3.11-UBA-1.0.1/coding-sensorML-v101-4.3.11-UBA-1.0.1.pom
[JENKINS] Archiving /var/lib/jenkins/workspace/deploy_SOS-UBA-mergable-series/coding/sensorML-v101/target/coding-sensorML-v101-4.3.11-UBA-1.0.1.jar to org.n52.sensorweb.sos/coding-sensorML-v101/4.3.11-UBA-1.0.1/coding-sensorML-v101-4.3.11-UBA-1.0.1.jar
[JENKINS] Archiving /var/lib/jenkins/workspace/deploy_SOS-UBA-mergable-series/coding/sensorML-v101/target/coding-sensorML-v101-4.3.11-UBA-1.0.1-sources.jar to org.n52.sensorweb.sos/coding-sensorML-v101/4.3.11-UBA-1.0.1/coding-sensorML-v101-4.3.11-UBA-1.0.1-sources.jar
[JENKINS] Archiving /var/lib/jenkins/workspace/deploy_SOS-UBA-mergable-series/hibernate/common/pom.xml to org.n52.sensorweb.sos/hibernate-common/4.3.11-UBA-1.0.1/hibernate-common-4.3.11-UBA-1.0.1.pom
[JENKINS] Archiving /var/lib/jenkins/workspace/deploy_SOS-UBA-mergable-series/hibernate/common/target/hibernate-common-4.3.11-UBA-1.0.1.jar to org.n52.sensorweb.sos/hibernate-common/4.3.11-UBA-1.0.1/hibernate-common-4.3.11-UBA-1.0.1.jar
[JENKINS] Archiving /var/lib/jenkins/workspace/deploy_SOS-UBA-mergable-series/hibernate/common/target/hibernate-common-4.3.11-UBA-1.0.1-sources.jar to org.n52.sensorweb.sos/hibernate-common/4.3.11-UBA-1.0.1/hibernate-common-4.3.11-UBA-1.0.1-sources.jar
[JENKINS] Archiving /var/lib/jenkins/workspace/deploy_SOS-UBA-mergable-series/extensions/inspire/code/pom.xml to org.n52.sensorweb.sos/inspire-code/4.3.11-UBA-1.0.1/inspire-code-4.3.11-UBA-1.0.1.pom
[JENKINS] Archiving /var/lib/jenkins/workspace/deploy_SOS-UBA-mergable-series/extensions/inspire/code/target/inspire-code-4.3.11-UBA-1.0.1.jar to org.n52.sensorweb.sos/inspire-code/4.3.11-UBA-1.0.1/inspire-code-4.3.11-UBA-1.0.1.jar
[JENKINS] Archiving /var/lib/jenkins/workspace/deploy_SOS-UBA-mergable-series/extensions/inspire/code/target/inspire-code-4.3.11-UBA-1.0.1-sources.jar to org.n52.sensorweb.sos/inspire-code/4.3.11-UBA-1.0.1/inspire-code-4.3.11-UBA-1.0.1-sources.jar
[JENKINS] Archiving /var/lib/jenkins/workspace/deploy_SOS-UBA-mergable-series/hibernate/pom.xml to org.n52.sensorweb.sos/hibernate/4.3.11-UBA-1.0.1/hibernate-4.3.11-UBA-1.0.1.pom
[JENKINS] Archiving /var/lib/jenkins/workspace/deploy_SOS-UBA-mergable-series/converter/transformation/pom.xml to org.n52.sensorweb.sos/transformation/4.3.11-UBA-1.0.1/transformation-4.3.11-UBA-1.0.1.pom
[JENKINS] Archiving /var/lib/jenkins/workspace/deploy_SOS-UBA-mergable-series/operations/pom.xml to org.n52.sensorweb.sos/operations/4.3.11-UBA-1.0.1/operations-4.3.11-UBA-1.0.1.pom
[JENKINS] Archiving /var/lib/jenkins/workspace/deploy_SOS-UBA-mergable-series/extensions/aqd/coding/aqd-v10/pom.xml to org.n52.sensorweb.sos/coding-aqd-v10/4.3.11-UBA-1.0.1/coding-aqd-v10-4.3.11-UBA-1.0.1.pom
[JENKINS] Archiving /var/lib/jenkins/workspace/deploy_SOS-UBA-mergable-series/extensions/aqd/coding/aqd-v10/target/coding-aqd-v10-4.3.11-UBA-1.0.1.jar to org.n52.sensorweb.sos/coding-aqd-v10/4.3.11-UBA-1.0.1/coding-aqd-v10-4.3.11-UBA-1.0.1.jar
[JENKINS] Archiving /var/lib/jenkins/workspace/deploy_SOS-UBA-mergable-series/extensions/aqd/coding/aqd-v10/target/coding-aqd-v10-4.3.11-UBA-1.0.1-sources.jar to org.n52.sensorweb.sos/coding-aqd-v10/4.3.11-UBA-1.0.1/coding-aqd-v10-4.3.11-UBA-1.0.1-sources.jar
[JENKINS] Archiving /var/lib/jenkins/workspace/deploy_SOS-UBA-mergable-series/extensions/aqd/ereporting/pom.xml to org.n52.sensorweb.sos/ereporting/4.3.11-UBA-1.0.1/ereporting-4.3.11-UBA-1.0.1.pom
[JENKINS] Archiving /var/lib/jenkins/workspace/deploy_SOS-UBA-mergable-series/extensions/aqd/ereporting/target/ereporting-4.3.11-UBA-1.0.1.jar to org.n52.sensorweb.sos/ereporting/4.3.11-UBA-1.0.1/ereporting-4.3.11-UBA-1.0.1.jar
[JENKINS] Archiving /var/lib/jenkins/workspace/deploy_SOS-UBA-mergable-series/extensions/aqd/ereporting/target/ereporting-4.3.11-UBA-1.0.1-sources.jar to org.n52.sensorweb.sos/ereporting/4.3.11-UBA-1.0.1/ereporting-4.3.11-UBA-1.0.1-sources.jar
[JENKINS] Archiving /var/lib/jenkins/workspace/deploy_SOS-UBA-mergable-series/operations/core-v100/pom.xml to org.n52.sensorweb.sos/core-v100/4.3.11-UBA-1.0.1/core-v100-4.3.11-UBA-1.0.1.pom
[JENKINS] Archiving /var/lib/jenkins/workspace/deploy_SOS-UBA-mergable-series/operations/core-v100/target/core-v100-4.3.11-UBA-1.0.1.jar to org.n52.sensorweb.sos/core-v100/4.3.11-UBA-1.0.1/core-v100-4.3.11-UBA-1.0.1.jar
[JENKINS] Archiving /var/lib/jenkins/workspace/deploy_SOS-UBA-mergable-series/operations/core-v100/target/core-v100-4.3.11-UBA-1.0.1-sources.jar to org.n52.sensorweb.sos/core-v100/4.3.11-UBA-1.0.1/core-v100-4.3.11-UBA-1.0.1-sources.jar
[JENKINS] Archiving /var/lib/jenkins/workspace/deploy_SOS-UBA-mergable-series/coding/sensorML-v20/pom.xml to org.n52.sensorweb.sos/coding-sensorML-v20/4.3.11-UBA-1.0.1/coding-sensorML-v20-4.3.11-UBA-1.0.1.pom
[JENKINS] Archiving /var/lib/jenkins/workspace/deploy_SOS-UBA-mergable-series/coding/sensorML-v20/target/coding-sensorML-v20-4.3.11-UBA-1.0.1.jar to org.n52.sensorweb.sos/coding-sensorML-v20/4.3.11-UBA-1.0.1/coding-sensorML-v20-4.3.11-UBA-1.0.1.jar
[JENKINS] Archiving /var/lib/jenkins/workspace/deploy_SOS-UBA-mergable-series/coding/sensorML-v20/target/coding-sensorML-v20-4.3.11-UBA-1.0.1-sources.jar to org.n52.sensorweb.sos/coding-sensorML-v20/4.3.11-UBA-1.0.1/coding-sensorML-v20-4.3.11-UBA-1.0.1-sources.jar
[JENKINS] Archiving /var/lib/jenkins/workspace/deploy_SOS-UBA-mergable-series/operations/transactional-v20/pom.xml to org.n52.sensorweb.sos/transactional-v20/4.3.11-UBA-1.0.1/transactional-v20-4.3.11-UBA-1.0.1.pom
[JENKINS] Archiving /var/lib/jenkins/workspace/deploy_SOS-UBA-mergable-series/operations/transactional-v20/target/transactional-v20-4.3.11-UBA-1.0.1.jar to org.n52.sensorweb.sos/transactional-v20/4.3.11-UBA-1.0.1/transactional-v20-4.3.11-UBA-1.0.1.jar
[JENKINS] Archiving /var/lib/jenkins/workspace/deploy_SOS-UBA-mergable-series/operations/transactional-v20/target/transactional-v20-4.3.11-UBA-1.0.1-sources.jar to org.n52.sensorweb.sos/transactional-v20/4.3.11-UBA-1.0.1/transactional-v20-4.3.11-UBA-1.0.1-sources.jar
[JENKINS] Archiving /var/lib/jenkins/workspace/deploy_SOS-UBA-mergable-series/operations/enhanced-v20/pom.xml to org.n52.sensorweb.sos/enhanced-v20/4.3.11-UBA-1.0.1/enhanced-v20-4.3.11-UBA-1.0.1.pom
[JENKINS] Archiving /var/lib/jenkins/workspace/deploy_SOS-UBA-mergable-series/operations/enhanced-v20/target/enhanced-v20-4.3.11-UBA-1.0.1.jar to org.n52.sensorweb.sos/enhanced-v20/4.3.11-UBA-1.0.1/enhanced-v20-4.3.11-UBA-1.0.1.jar
[JENKINS] Archiving /var/lib/jenkins/workspace/deploy_SOS-UBA-mergable-series/operations/enhanced-v20/target/enhanced-v20-4.3.11-UBA-1.0.1-sources.jar to org.n52.sensorweb.sos/enhanced-v20/4.3.11-UBA-1.0.1/enhanced-v20-4.3.11-UBA-1.0.1-sources.jar
[JENKINS] Archiving /var/lib/jenkins/workspace/deploy_SOS-UBA-mergable-series/hibernate/datasource/mysql/pom.xml to org.n52.sensorweb.sos/hibernate-datasource-mysql/4.3.11-UBA-1.0.1/hibernate-datasource-mysql-4.3.11-UBA-1.0.1.pom
[JENKINS] Archiving /var/lib/jenkins/workspace/deploy_SOS-UBA-mergable-series/hibernate/datasource/mysql/target/hibernate-datasource-mysql-4.3.11-UBA-1.0.1.jar to org.n52.sensorweb.sos/hibernate-datasource-mysql/4.3.11-UBA-1.0.1/hibernate-datasource-mysql-4.3.11-UBA-1.0.1.jar
[JENKINS] Archiving /var/lib/jenkins/workspace/deploy_SOS-UBA-mergable-series/hibernate/datasource/mysql/target/hibernate-datasource-mysql-4.3.11-UBA-1.0.1-sources.jar to org.n52.sensorweb.sos/hibernate-datasource-mysql/4.3.11-UBA-1.0.1/hibernate-datasource-mysql-4.3.11-UBA-1.0.1-sources.jar
[JENKINS] Archiving /var/lib/jenkins/workspace/deploy_SOS-UBA-mergable-series/converter/identifier-modifier/pom.xml to org.n52.sensorweb.sos/identifier-modifier/4.3.11-UBA-1.0.1/identifier-modifier-4.3.11-UBA-1.0.1.pom
[JENKINS] Archiving /var/lib/jenkins/workspace/deploy_SOS-UBA-mergable-series/hibernate/datasource/postgres/pom.xml to org.n52.sensorweb.sos/hibernate-datasource-postgres/4.3.11-UBA-1.0.1/hibernate-datasource-postgres-4.3.11-UBA-1.0.1.pom
[JENKINS] Archiving /var/lib/jenkins/workspace/deploy_SOS-UBA-mergable-series/hibernate/datasource/postgres/target/hibernate-datasource-postgres-4.3.11-UBA-1.0.1.jar to org.n52.sensorweb.sos/hibernate-datasource-postgres/4.3.11-UBA-1.0.1/hibernate-datasource-postgres-4.3.11-UBA-1.0.1.jar
[JENKINS] Archiving /var/lib/jenkins/workspace/deploy_SOS-UBA-mergable-series/hibernate/datasource/postgres/target/hibernate-datasource-postgres-4.3.11-UBA-1.0.1-sources.jar to org.n52.sensorweb.sos/hibernate-datasource-postgres/4.3.11-UBA-1.0.1/hibernate-datasource-postgres-4.3.11-UBA-1.0.1-sources.jar
[JENKINS] Archiving /var/lib/jenkins/workspace/deploy_SOS-UBA-mergable-series/hibernate/dao/pom.xml to org.n52.sensorweb.sos/hibernate-dao/4.3.11-UBA-1.0.1/hibernate-dao-4.3.11-UBA-1.0.1.pom
[JENKINS] Archiving /var/lib/jenkins/workspace/deploy_SOS-UBA-mergable-series/hibernate/dao/target/hibernate-dao-4.3.11-UBA-1.0.1.jar to org.n52.sensorweb.sos/hibernate-dao/4.3.11-UBA-1.0.1/hibernate-dao-4.3.11-UBA-1.0.1.jar
[JENKINS] Archiving /var/lib/jenkins/workspace/deploy_SOS-UBA-mergable-series/hibernate/dao/target/hibernate-dao-4.3.11-UBA-1.0.1-sources.jar to org.n52.sensorweb.sos/hibernate-dao/4.3.11-UBA-1.0.1/hibernate-dao-4.3.11-UBA-1.0.1-sources.jar
[JENKINS] Archiving /var/lib/jenkins/workspace/deploy_SOS-UBA-mergable-series/core/admin/pom.xml to org.n52.sensorweb.sos/admin/4.3.11-UBA-1.0.1/admin-4.3.11-UBA-1.0.1.pom
[JENKINS] Archiving /var/lib/jenkins/workspace/deploy_SOS-UBA-mergable-series/core/admin/target/admin-4.3.11-UBA-1.0.1.jar to org.n52.sensorweb.sos/admin/4.3.11-UBA-1.0.1/admin-4.3.11-UBA-1.0.1.jar
[JENKINS] Archiving /var/lib/jenkins/workspace/deploy_SOS-UBA-mergable-series/core/admin/target/admin-4.3.11-UBA-1.0.1-sources.jar to org.n52.sensorweb.sos/admin/4.3.11-UBA-1.0.1/admin-4.3.11-UBA-1.0.1-sources.jar
[JENKINS] Archiving /var/lib/jenkins/workspace/deploy_SOS-UBA-mergable-series/coding/sos-v20/pom.xml to org.n52.sensorweb.sos/coding-sos-v20/4.3.11-UBA-1.0.1/coding-sos-v20-4.3.11-UBA-1.0.1.pom
[JENKINS] Archiving /var/lib/jenkins/workspace/deploy_SOS-UBA-mergable-series/coding/sos-v20/target/coding-sos-v20-4.3.11-UBA-1.0.1.jar to org.n52.sensorweb.sos/coding-sos-v20/4.3.11-UBA-1.0.1/coding-sos-v20-4.3.11-UBA-1.0.1.jar
[JENKINS] Archiving /var/lib/jenkins/workspace/deploy_SOS-UBA-mergable-series/coding/sos-v20/target/coding-sos-v20-4.3.11-UBA-1.0.1-sources.jar to org.n52.sensorweb.sos/coding-sos-v20/4.3.11-UBA-1.0.1/coding-sos-v20-4.3.11-UBA-1.0.1-sources.jar
[JENKINS] Archiving /var/lib/jenkins/workspace/deploy_SOS-UBA-mergable-series/extensions/gda/operation/pom.xml to org.n52.sensorweb.sos/gda-operation/4.3.11-UBA-1.0.1/gda-operation-4.3.11-UBA-1.0.1.pom
[JENKINS] Archiving /var/lib/jenkins/workspace/deploy_SOS-UBA-mergable-series/extensions/gda/operation/target/gda-operation-4.3.11-UBA-1.0.1.jar to org.n52.sensorweb.sos/gda-operation/4.3.11-UBA-1.0.1/gda-operation-4.3.11-UBA-1.0.1.jar
[JENKINS] Archiving /var/lib/jenkins/workspace/deploy_SOS-UBA-mergable-series/extensions/gda/operation/target/gda-operation-4.3.11-UBA-1.0.1-sources.jar to org.n52.sensorweb.sos/gda-operation/4.3.11-UBA-1.0.1/gda-operation-4.3.11-UBA-1.0.1-sources.jar
[JENKINS] Archiving /var/lib/jenkins/workspace/deploy_SOS-UBA-mergable-series/hibernate/datasource/h2/pom.xml to org.n52.sensorweb.sos/hibernate-datasource-h2/4.3.11-UBA-1.0.1/hibernate-datasource-h2-4.3.11-UBA-1.0.1.pom
[JENKINS] Archiving /var/lib/jenkins/workspace/deploy_SOS-UBA-mergable-series/hibernate/datasource/h2/target/hibernate-datasource-h2-4.3.11-UBA-1.0.1.jar to org.n52.sensorweb.sos/hibernate-datasource-h2/4.3.11-UBA-1.0.1/hibernate-datasource-h2-4.3.11-UBA-1.0.1.jar
[JENKINS] Archiving /var/lib/jenkins/workspace/deploy_SOS-UBA-mergable-series/hibernate/datasource/h2/target/hibernate-datasource-h2-4.3.11-UBA-1.0.1-sources.jar to org.n52.sensorweb.sos/hibernate-datasource-h2/4.3.11-UBA-1.0.1/hibernate-datasource-h2-4.3.11-UBA-1.0.1-sources.jar
[JENKINS] Archiving /var/lib/jenkins/workspace/deploy_SOS-UBA-mergable-series/converter/pom.xml to org.n52.sensorweb.sos/converter/4.3.11-UBA-1.0.1/converter-4.3.11-UBA-1.0.1.pom
[JENKINS] Archiving /var/lib/jenkins/workspace/deploy_SOS-UBA-mergable-series/spring/install-controller/pom.xml to org.n52.sensorweb.sos/install-controller/4.3.11-UBA-1.0.1/install-controller-4.3.11-UBA-1.0.1.pom
[JENKINS] Archiving /var/lib/jenkins/workspace/deploy_SOS-UBA-mergable-series/spring/install-controller/target/install-controller-4.3.11-UBA-1.0.1.jar to org.n52.sensorweb.sos/install-controller/4.3.11-UBA-1.0.1/install-controller-4.3.11-UBA-1.0.1.jar
[JENKINS] Archiving /var/lib/jenkins/workspace/deploy_SOS-UBA-mergable-series/spring/install-controller/target/install-controller-4.3.11-UBA-1.0.1-sources.jar to org.n52.sensorweb.sos/install-controller/4.3.11-UBA-1.0.1/install-controller-4.3.11-UBA-1.0.1-sources.jar
[JENKINS] Archiving /var/lib/jenkins/workspace/deploy_SOS-UBA-mergable-series/core/pom.xml to org.n52.sensorweb.sos/core/4.3.11-UBA-1.0.1/core-4.3.11-UBA-1.0.1.pom
channel stopped
Sending e-mails to: h.bredel@52north.org
Finished: FAILURE