FailedConsole Output

Started by user BenjaminPross
Building in workspace /var/lib/jenkins/workspace/WPS-Extension-Skeleton_GIT-MASTER_RELEASE
No JDK named ‘(Vorgabewert)’ found
 > git rev-parse --is-inside-work-tree
Fetching changes from the remote Git repository
 > git config remote.origin.url ssh://git@github.com/52North/WPS-Extension-Skeleton.git
Fetching upstream changes from ssh://git@github.com/52North/WPS-Extension-Skeleton.git
 > git --version
 > git fetch --tags --progress ssh://git@github.com/52North/WPS-Extension-Skeleton.git +refs/heads/master:refs/remotes/origin/master
 > git rev-parse origin/master^{commit}
Checking out Revision 9ca2c2812933bcc4f1a7cd03c0b1aff80b3ca979 (origin/master)
 > git config core.sparsecheckout
 > git checkout -f 9ca2c2812933bcc4f1a7cd03c0b1aff80b3ca979
 > git branch -a
 > git rev-parse master^{commit}
 > git rev-parse remotes/origin/master^{commit}
 > git branch -D master
 > git checkout -b master 9ca2c2812933bcc4f1a7cd03c0b1aff80b3ca979
 > git rev-list 4eade1ca10f85d801d100e8a28cc305e86d3e893
 > git tag -a -f -m Jenkins Build #4 jenkins-WPS-Extension-Skeleton_GIT-MASTER_RELEASE-4
No JDK named ‘(Vorgabewert)’ found
Parsing POMs
[WPS-Extension-Skeleton_GIT-MASTER_RELEASE] $ java -Xmx1024m -XX:MaxPermSize=1024m -cp /var/lib/jenkins/plugins/maven-plugin/WEB-INF/lib/maven31-agent-1.5.jar:/var/lib/jenkins/tools/hudson.tasks.Maven_MavenInstallation/Maven_3.0.x/boot/plexus-classworlds-2.5.1.jar:/var/lib/jenkins/tools/hudson.tasks.Maven_MavenInstallation/Maven_3.0.x/conf/logging jenkins.maven3.agent.Maven31Main /var/lib/jenkins/tools/hudson.tasks.Maven_MavenInstallation/Maven_3.0.x /var/cache/jenkins/war/WEB-INF/lib/remoting-2.43.jar /var/lib/jenkins/plugins/maven-plugin/WEB-INF/lib/maven31-interceptor-1.5.jar /var/lib/jenkins/plugins/maven-plugin/WEB-INF/lib/maven3-interceptor-commons-1.5.jar 44049
<===[JENKINS REMOTING CAPACITY]===>channel started
Executing Maven:  -B -f /var/lib/jenkins/workspace/WPS-Extension-Skeleton_GIT-MASTER_RELEASE/pom.xml clean install
[INFO] Scanning for projects...
[INFO] 
[INFO] Using the builder org.apache.maven.lifecycle.internal.builder.singlethreaded.SingleThreadedBuilder with a thread count of 1
[INFO]                                                                         
[INFO] ------------------------------------------------------------------------
[INFO] Building process-extensions 0.0.1-SNAPSHOT
[INFO] ------------------------------------------------------------------------
[INFO] 
[INFO] --- maven-clean-plugin:2.5:clean (default-clean) @ process-extensions ---
[INFO] Deleting /var/lib/jenkins/workspace/WPS-Extension-Skeleton_GIT-MASTER_RELEASE/target
[INFO] 
[INFO] --- maven-resources-plugin:2.6:resources (default-resources) @ process-extensions ---
[WARNING] Using platform encoding (UTF-8 actually) to copy filtered resources, i.e. build is platform dependent!
[INFO] Copying 1 resource
[INFO] 
[INFO] --- maven-compiler-plugin:2.5.1:compile (default-compile) @ process-extensions ---
[WARNING] File encoding has not been set, using platform encoding UTF-8, i.e. build is platform dependent!
[INFO] Compiling 3 source files to /var/lib/jenkins/workspace/WPS-Extension-Skeleton_GIT-MASTER_RELEASE/target/classes
[INFO] 
[INFO] --- maven-resources-plugin:2.6:testResources (default-testResources) @ process-extensions ---
[WARNING] Using platform encoding (UTF-8 actually) to copy filtered resources, i.e. build is platform dependent!
[INFO] Copying 3 resources
[INFO] 
[INFO] --- maven-compiler-plugin:2.5.1:testCompile (default-testCompile) @ process-extensions ---
[WARNING] File encoding has not been set, using platform encoding UTF-8, i.e. build is platform dependent!
[INFO] Compiling 2 source files to /var/lib/jenkins/workspace/WPS-Extension-Skeleton_GIT-MASTER_RELEASE/target/test-classes
[INFO] 
[INFO] --- maven-surefire-plugin:2.12.4:test (default-test) @ process-extensions ---
[INFO] Surefire report directory: /var/lib/jenkins/workspace/WPS-Extension-Skeleton_GIT-MASTER_RELEASE/target/surefire-reports

-------------------------------------------------------
 T E S T S
-------------------------------------------------------
Running org.n52.wps.extension.ExtensionAlgorithmTest
Aug 6, 2014 12:50:42 PM org.geotools.feature.simple.SimpleFeatureTypeBuilder add
WARNING: Creating the_geom with null CoordinateReferenceSystem - did you mean to setCRS?
2014-08-06 12:50:42,220 [main] INFO  org.n52.wps.extension.ExtensionAlgorithmTest: Succesfully retrieved result: 'org.n52.wps.io.data.binding.complex.GTVectorDataBinding@62cc9d70'
Tests run: 1, Failures: 0, Errors: 0, Skipped: 0, Time elapsed: 2.999 sec
Running org.n52.wps.extension.AnnotatedExtensionAlgorithmTest
Aug 6, 2014 12:50:42 PM org.geotools.feature.simple.SimpleFeatureTypeBuilder add
WARNING: Creating the_geom with null CoordinateReferenceSystem - did you mean to setCRS?
2014-08-06 12:50:42,413 [main] INFO  org.n52.wps.extension.AnnotatedExtensionAlgorithmTest: Output identifier is 'output'
2014-08-06 12:50:42,413 [main] INFO  org.n52.wps.extension.AnnotatedExtensionAlgorithmTest: Output identifier is 'output'
2014-08-06 12:50:42,413 [main] INFO  org.n52.wps.extension.AnnotatedExtensionAlgorithmTest: Succesfully retrieved result: 'org.n52.wps.io.data.binding.literal.LiteralStringBinding@5d1d20d3'
Tests run: 1, Failures: 0, Errors: 0, Skipped: 0, Time elapsed: 0.155 sec

Results :

Tests run: 2, Failures: 0, Errors: 0, Skipped: 0

[JENKINS] Recording test results
log4j:WARN No appenders could be found for logger (org.apache.commons.beanutils.converters.BooleanConverter).
log4j:WARN Please initialize the log4j system properly.
[INFO] 
[INFO] --- maven-jar-plugin:2.4:jar (default-jar) @ process-extensions ---
[INFO] Building jar: /var/lib/jenkins/workspace/WPS-Extension-Skeleton_GIT-MASTER_RELEASE/target/process-extensions-0.0.1-SNAPSHOT.jar
[INFO] 
[INFO] --- maven-site-plugin:2.3:attach-descriptor (attach-descriptor) @ process-extensions ---
[INFO] 
[INFO] --- maven-install-plugin:2.4:install (default-install) @ process-extensions ---
[INFO] Installing /var/lib/jenkins/workspace/WPS-Extension-Skeleton_GIT-MASTER_RELEASE/target/process-extensions-0.0.1-SNAPSHOT.jar to /var/lib/jenkins/.m2/repository/org/n52/wps-extension/process-extensions/0.0.1-SNAPSHOT/process-extensions-0.0.1-SNAPSHOT.jar
[INFO] Installing /var/lib/jenkins/workspace/WPS-Extension-Skeleton_GIT-MASTER_RELEASE/pom.xml to /var/lib/jenkins/.m2/repository/org/n52/wps-extension/process-extensions/0.0.1-SNAPSHOT/process-extensions-0.0.1-SNAPSHOT.pom
[INFO] ------------------------------------------------------------------------
[INFO] BUILD SUCCESS
[INFO] ------------------------------------------------------------------------
[INFO] Total time: 11.573 s
[INFO] Finished at: 2014-08-06T12:50:47+01:00
[INFO] Final Memory: 23M/113M
[INFO] ------------------------------------------------------------------------
Waiting for Jenkins to finish collecting data
[JENKINS] Archiving /var/lib/jenkins/workspace/WPS-Extension-Skeleton_GIT-MASTER_RELEASE/pom.xml to org.n52.wps-extension/process-extensions/0.0.1-SNAPSHOT/process-extensions-0.0.1-SNAPSHOT.pom
[JENKINS] Archiving /var/lib/jenkins/workspace/WPS-Extension-Skeleton_GIT-MASTER_RELEASE/target/process-extensions-0.0.1-SNAPSHOT.jar to org.n52.wps-extension/process-extensions/0.0.1-SNAPSHOT/process-extensions-0.0.1-SNAPSHOT.jar
Sending e-mails to: b.pross@52north.org
channel stopped
Maven RedeployPublisher use remote  maven settings from : /var/lib/jenkins/.m2/settings.xml
[INFO] Deployment in https://52north.org/maven/repo/snapshots/ (id=n52-snapshots-dist,uniqueVersion=true)
Deploying the main artifact process-extensions-0.0.1-SNAPSHOT.jar
Downloading: https://52north.org/maven/repo/snapshots/org/n52/wps-extension/process-extensions/0.0.1-SNAPSHOT/maven-metadata.xml
Uploading: https://52north.org/maven/repo/snapshots/org/n52/wps-extension/process-extensions/0.0.1-SNAPSHOT/process-extensions-0.0.1-20140806.105048-1.jar
Uploading: https://52north.org/maven/repo/snapshots/org/n52/wps-extension/process-extensions/0.0.1-SNAPSHOT/process-extensions-0.0.1-20140806.105048-1.pom
ERROR: Failed to deploy artifacts: Could not transfer artifact org.n52.wps-extension:process-extensions:jar:0.0.1-20140806.105048-1 from/to n52-snapshots-dist (https://52north.org/maven/repo/snapshots/): Access denied to: https://52north.org/maven/repo/snapshots/org/n52/wps-extension/process-extensions/0.0.1-SNAPSHOT/process-extensions-0.0.1-20140806.105048-1.jar, ReasonPhrase: Forbidden.
org.apache.maven.artifact.deployer.ArtifactDeploymentException: Failed to deploy artifacts: Could not transfer artifact org.n52.wps-extension:process-extensions:jar:0.0.1-20140806.105048-1 from/to n52-snapshots-dist (https://52north.org/maven/repo/snapshots/): Access denied to: https://52north.org/maven/repo/snapshots/org/n52/wps-extension/process-extensions/0.0.1-SNAPSHOT/process-extensions-0.0.1-20140806.105048-1.jar, ReasonPhrase: Forbidden.
	at org.apache.maven.artifact.deployer.DefaultArtifactDeployer.deploy(DefaultArtifactDeployer.java:143)
	at hudson.maven.reporters.MavenArtifactRecord.deploy(MavenArtifactRecord.java:193)
	at hudson.maven.RedeployPublisher.perform(RedeployPublisher.java:176)
	at hudson.tasks.BuildStepMonitor$1.perform(BuildStepMonitor.java:20)
	at hudson.model.AbstractBuild$AbstractBuildExecution.perform(AbstractBuild.java:772)
	at hudson.model.AbstractBuild$AbstractBuildExecution.performAllBuildSteps(AbstractBuild.java:736)
	at hudson.maven.MavenModuleSetBuild$MavenModuleSetBuildExecution.post2(MavenModuleSetBuild.java:1040)
	at hudson.model.AbstractBuild$AbstractBuildExecution.post(AbstractBuild.java:685)
	at hudson.model.Run.execute(Run.java:1757)
	at hudson.maven.MavenModuleSetBuild.run(MavenModuleSetBuild.java:529)
	at hudson.model.ResourceController.execute(ResourceController.java:88)
	at hudson.model.Executor.run(Executor.java:234)
Caused by: org.eclipse.aether.deployment.DeploymentException: Failed to deploy artifacts: Could not transfer artifact org.n52.wps-extension:process-extensions:jar:0.0.1-20140806.105048-1 from/to n52-snapshots-dist (https://52north.org/maven/repo/snapshots/): Access denied to: https://52north.org/maven/repo/snapshots/org/n52/wps-extension/process-extensions/0.0.1-SNAPSHOT/process-extensions-0.0.1-20140806.105048-1.jar, ReasonPhrase: Forbidden.
	at org.eclipse.aether.internal.impl.DefaultDeployer.deploy(DefaultDeployer.java:341)
	at org.eclipse.aether.internal.impl.DefaultDeployer.deploy(DefaultDeployer.java:269)
	at org.eclipse.aether.internal.impl.DefaultRepositorySystem.deploy(DefaultRepositorySystem.java:413)
	at org.apache.maven.artifact.deployer.DefaultArtifactDeployer.deploy(DefaultArtifactDeployer.java:139)
	... 11 more
Caused by: org.eclipse.aether.transfer.ArtifactTransferException: Could not transfer artifact org.n52.wps-extension:process-extensions:jar:0.0.1-20140806.105048-1 from/to n52-snapshots-dist (https://52north.org/maven/repo/snapshots/): Access denied to: https://52north.org/maven/repo/snapshots/org/n52/wps-extension/process-extensions/0.0.1-SNAPSHOT/process-extensions-0.0.1-20140806.105048-1.jar, ReasonPhrase: Forbidden.
	at org.eclipse.aether.connector.wagon.WagonRepositoryConnector$6.wrap(WagonRepositoryConnector.java:1016)
	at org.eclipse.aether.connector.wagon.WagonRepositoryConnector$6.wrap(WagonRepositoryConnector.java:1004)
	at org.eclipse.aether.connector.wagon.WagonRepositoryConnector$PutTask.run(WagonRepositoryConnector.java:895)
	at org.eclipse.aether.connector.wagon.WagonRepositoryConnector.put(WagonRepositoryConnector.java:522)
	at org.eclipse.aether.internal.impl.DefaultDeployer.deploy(DefaultDeployer.java:335)
	... 14 more
Caused by: org.apache.maven.wagon.authorization.AuthorizationException: Access denied to: https://52north.org/maven/repo/snapshots/org/n52/wps-extension/process-extensions/0.0.1-SNAPSHOT/process-extensions-0.0.1-20140806.105048-1.jar, ReasonPhrase: Forbidden.
	at org.apache.maven.wagon.shared.http4.AbstractHttpClientWagon.put(AbstractHttpClientWagon.java:618)
	at org.apache.maven.wagon.shared.http4.AbstractHttpClientWagon.put(AbstractHttpClientWagon.java:524)
	at org.apache.maven.wagon.shared.http4.AbstractHttpClientWagon.put(AbstractHttpClientWagon.java:505)
	at org.apache.maven.wagon.shared.http4.AbstractHttpClientWagon.put(AbstractHttpClientWagon.java:485)
	at org.eclipse.aether.connector.wagon.WagonRepositoryConnector$PutTask.run(WagonRepositoryConnector.java:871)
	... 16 more
[INFO] Deployment failed after 0.76 sec
Build step 'Deploy artifacts to Maven repository' changed build result to FAILURE
Sending e-mails to: b.pross@52north.org
Finished: FAILURE