UnstableConsole Output

Started by user MatthesRieke
Building in workspace /var/lib/jenkins/workspace/SOS-SOE ags.dev validation+integration test
 > git rev-parse --is-inside-work-tree # timeout=10
Fetching changes from the remote Git repository
 > git config remote.origin.url https://github.com/52North/SOS-SOE-integration-tests.git # timeout=10
Fetching upstream changes from https://github.com/52North/SOS-SOE-integration-tests.git
 > git --version # timeout=10
 > git -c core.askpass=true fetch --tags --progress https://github.com/52North/SOS-SOE-integration-tests.git +refs/heads/*:refs/remotes/origin/*
Seen branch in repository origin/master
Seen 1 remote branch
Checking out Revision 3949331004a264105ce6882ad21410b04ebdd848 (origin/master)
 > git config core.sparsecheckout # timeout=10
 > git checkout -f 3949331004a264105ce6882ad21410b04ebdd848
 > git rev-list 3949331004a264105ce6882ad21410b04ebdd848 # timeout=10
 > git tag -a -f -m Jenkins Build #3464 jenkins-SOS-SOE_ags.dev_validation+integration_test-3464 # timeout=10
Parsing POMs
[SOS-SOE ags.dev validation+integration test] $ /var/lib/jenkins/tools/hudson.model.JDK/Java-1.7/bin/java -Xmx1024m -XX:MaxPermSize=1024m -cp /var/lib/jenkins/plugins/maven-plugin/WEB-INF/lib/maven32-agent-1.6.jar:/var/lib/jenkins/tools/hudson.tasks.Maven_MavenInstallation/Maven_3.0.x/boot/plexus-classworlds-2.5.1.jar:/var/lib/jenkins/tools/hudson.tasks.Maven_MavenInstallation/Maven_3.0.x/conf/logging jenkins.maven3.agent.Maven32Main /var/lib/jenkins/tools/hudson.tasks.Maven_MavenInstallation/Maven_3.0.x /var/cache/jenkins/war/WEB-INF/lib/remoting-2.51.jar /var/lib/jenkins/plugins/maven-plugin/WEB-INF/lib/maven32-interceptor-1.6.jar /var/lib/jenkins/plugins/maven-plugin/WEB-INF/lib/maven3-interceptor-commons-1.6.jar 38467
<===[JENKINS REMOTING CAPACITY]===>channel started
Executing Maven:  -B -f /var/lib/jenkins/workspace/SOS-SOE ags.dev validation+integration test/pom.xml clean install -Dsos.service.url=http://ags.dev.52north.org:6080/arcgis/rest/services/EEA/Airquality_E1a_Germany/MapServer/exts/52nArcGisSos/
[INFO] Scanning for projects...
[INFO] ------------------------------------------------------------------------
[INFO] Reactor Build Order:
[INFO] 
[INFO] Integration Tests for the ArcGIS-Server-SOS-Extension
[INFO] SOS-SOE-it-bindings
[INFO] SOS-SOE-it-execution
[INFO] 
[INFO] Using the builder org.apache.maven.lifecycle.internal.builder.singlethreaded.SingleThreadedBuilder with a thread count of 1
[INFO]                                                                         
[INFO] ------------------------------------------------------------------------
[INFO] Building Integration Tests for the ArcGIS-Server-SOS-Extension 1.0.0-SNAPSHOT
[INFO] ------------------------------------------------------------------------
[INFO] 
[INFO] --- maven-clean-plugin:2.5:clean (default-clean) @ SOS-SOE-it ---
[INFO] 
[INFO] --- maven-license-plugin:1.9.0:check (check-headers) @ SOS-SOE-it ---
[INFO] Checking licenses...
[INFO] 
[INFO] --- maven-install-plugin:2.4:install (default-install) @ SOS-SOE-it ---
[INFO] Installing /var/lib/jenkins/workspace/SOS-SOE ags.dev validation+integration test/pom.xml to /var/lib/jenkins/.m2/repository/org/n52/sensorweb/SOS-SOE-it/1.0.0-SNAPSHOT/SOS-SOE-it-1.0.0-SNAPSHOT.pom
[INFO]                                                                         
[INFO] ------------------------------------------------------------------------
[INFO] Building SOS-SOE-it-bindings 1.0.0-SNAPSHOT
[INFO] ------------------------------------------------------------------------
[INFO] 
[INFO] --- maven-clean-plugin:2.5:clean (default-clean) @ SOS-SOE-it-bindings ---
[INFO] Deleting /var/lib/jenkins/workspace/SOS-SOE ags.dev validation+integration test/binding/target
[INFO] 
[INFO] --- xmlbeans-maven-plugin:2.3.3:xmlbeans (main) @ SOS-SOE-it-bindings ---
[INFO] 
[INFO] --- maven-resources-plugin:2.6:resources (default-resources) @ SOS-SOE-it-bindings ---
[INFO] Using 'UTF-8' encoding to copy filtered resources.
[INFO] skip non existing resourceDirectory /var/lib/jenkins/workspace/SOS-SOE ags.dev validation+integration test/binding/src/main/resources
[INFO] Copying 2025 resources
[INFO] 
[INFO] --- maven-compiler-plugin:3.1:compile (default-compile) @ SOS-SOE-it-bindings ---
[INFO] Changes detected - recompiling the module!
[INFO] Compiling 970 source files to /var/lib/jenkins/workspace/SOS-SOE ags.dev validation+integration test/binding/target/classes
[WARNING] /var/lib/jenkins/workspace/SOS-SOE ags.dev validation+integration test/binding/target/generated-sources/xmlbeans/eu/europa/ec/aqd/aqd/x03/impl/AQDPlanTypeImpl.java: Some input files use unchecked or unsafe operations.
[WARNING] /var/lib/jenkins/workspace/SOS-SOE ags.dev validation+integration test/binding/target/generated-sources/xmlbeans/eu/europa/ec/aqd/aqd/x03/impl/AQDPlanTypeImpl.java: Recompile with -Xlint:unchecked for details.
[INFO] 
[INFO] --- maven-resources-plugin:2.6:testResources (default-testResources) @ SOS-SOE-it-bindings ---
[INFO] Using 'UTF-8' encoding to copy filtered resources.
[INFO] skip non existing resourceDirectory /var/lib/jenkins/workspace/SOS-SOE ags.dev validation+integration test/binding/src/test/resources
[INFO] 
[INFO] --- maven-compiler-plugin:3.1:testCompile (default-testCompile) @ SOS-SOE-it-bindings ---
[INFO] No sources to compile
[INFO] 
[INFO] --- maven-surefire-plugin:2.12.4:test (default-test) @ SOS-SOE-it-bindings ---
[INFO] No tests to run.
[JENKINS] Recording test results
[INFO] 
[INFO] --- maven-jar-plugin:2.4:jar (default-jar) @ SOS-SOE-it-bindings ---
[INFO] Building jar: /var/lib/jenkins/workspace/SOS-SOE ags.dev validation+integration test/binding/target/SOS-SOE-it-bindings-1.0.0-SNAPSHOT.jar
[INFO] 
[INFO] --- maven-install-plugin:2.4:install (default-install) @ SOS-SOE-it-bindings ---
[INFO] Installing /var/lib/jenkins/workspace/SOS-SOE ags.dev validation+integration test/binding/target/SOS-SOE-it-bindings-1.0.0-SNAPSHOT.jar to /var/lib/jenkins/.m2/repository/org/n52/sensorweb/SOS-SOE-it-bindings/1.0.0-SNAPSHOT/SOS-SOE-it-bindings-1.0.0-SNAPSHOT.jar
[INFO] Installing /var/lib/jenkins/workspace/SOS-SOE ags.dev validation+integration test/binding/pom.xml to /var/lib/jenkins/.m2/repository/org/n52/sensorweb/SOS-SOE-it-bindings/1.0.0-SNAPSHOT/SOS-SOE-it-bindings-1.0.0-SNAPSHOT.pom
[INFO]                                                                         
[INFO] ------------------------------------------------------------------------
[INFO] Building SOS-SOE-it-execution 1.0.0-SNAPSHOT
[INFO] ------------------------------------------------------------------------
[INFO] 
[INFO] --- maven-clean-plugin:2.5:clean (default-clean) @ SOS-SOE-it-execution ---
[INFO] Deleting /var/lib/jenkins/workspace/SOS-SOE ags.dev validation+integration test/execution/target
[INFO] 
[INFO] --- maven-resources-plugin:2.6:resources (default-resources) @ SOS-SOE-it-execution ---
[INFO] Using 'UTF-8' encoding to copy filtered resources.
[INFO] skip non existing resourceDirectory /var/lib/jenkins/workspace/SOS-SOE ags.dev validation+integration test/execution/src/main/resources
[INFO] 
[INFO] --- maven-compiler-plugin:3.1:compile (default-compile) @ SOS-SOE-it-execution ---
[INFO] No sources to compile
[INFO] 
[INFO] --- maven-resources-plugin:2.6:testResources (default-testResources) @ SOS-SOE-it-execution ---
[INFO] Using 'UTF-8' encoding to copy filtered resources.
[INFO] Copying 6 resources
[INFO] 
[INFO] --- maven-compiler-plugin:3.1:testCompile (default-testCompile) @ SOS-SOE-it-execution ---
[INFO] Changes detected - recompiling the module!
[INFO] Compiling 12 source files to /var/lib/jenkins/workspace/SOS-SOE ags.dev validation+integration test/execution/target/test-classes
[WARNING] /var/lib/jenkins/workspace/SOS-SOE ags.dev validation+integration test/execution/src/test/java/org/n52/sos/soe/AbstractValidationTest.java: Some input files use or override a deprecated API.
[WARNING] /var/lib/jenkins/workspace/SOS-SOE ags.dev validation+integration test/execution/src/test/java/org/n52/sos/soe/AbstractValidationTest.java: Recompile with -Xlint:deprecation for details.
[INFO] 
[INFO] --- maven-surefire-plugin:2.12.4:test (default-test) @ SOS-SOE-it-execution ---
[INFO] Surefire report directory: /var/lib/jenkins/workspace/SOS-SOE ags.dev validation+integration test/execution/target/surefire-reports

-------------------------------------------------------
 T E S T S
-------------------------------------------------------
Running org.n52.sos.soe.GetFirstGetLatestObservationTest
2015-06-25 13:22:45,710 [main] INFO  org.n52.sos.soe.HttpUtil: http://ags.dev.52north.org:6080/arcgis/rest/services/EEA/Airquality_E/MapServer/exts/52nArcGisSos/
2015-06-25 13:22:45,965 [main] INFO  org.n52.sos.soe.HttpUtil: HTTP GET: http://ags.dev.52north.org:6080/arcgis/rest/services/EEA/Airquality_E/MapServer/exts/52nArcGisSos/GetObservation?service=SOS&version=2.0.0&request=GetObservation&observedProperty=http%3A%2F%2Fdd.eionet.europa.eu%2Fvocabulary%2Faq%2Fpollutant%2F1&procedure=http%3A%2F%2Fcdr.eionet.europa.eu%2Fpl%2Feu%2Faqd%2Fd%2Fenvuvt6ea%2FPL_REPORT_D_FOR_2014v2.xml%23SPO_P_PL0518A_1_001&f=xml&temporalFilter=om:phenomenonTime,first
2015-06-25 13:22:46,093 [main] INFO  org.n52.sos.soe.HttpUtil: Request latency: 128
2015-06-25 13:22:46,218 [main] INFO  org.n52.sos.soe.HttpUtil: http://ags.dev.52north.org:6080/arcgis/rest/services/EEA/Airquality_E/MapServer/exts/52nArcGisSos/
2015-06-25 13:22:46,225 [main] INFO  org.n52.sos.soe.HttpUtil: HTTP GET: http://ags.dev.52north.org:6080/arcgis/rest/services/EEA/Airquality_E/MapServer/exts/52nArcGisSos/GetObservation?service=SOS&version=2.0.0&request=GetObservation&observedProperty=http%3A%2F%2Fdd.eionet.europa.eu%2Fvocabulary%2Faq%2Fpollutant%2F1&procedure=http%3A%2F%2Fcdr.eionet.europa.eu%2Fpl%2Feu%2Faqd%2Fd%2Fenvuvt6ea%2FPL_REPORT_D_FOR_2014v2.xml%23SPO_P_PL0518A_1_001&f=xml&temporalFilter=om:phenomenonTime,latest
2015-06-25 13:22:46,271 [main] INFO  org.n52.sos.soe.HttpUtil: Request latency: 46
Tests run: 2, Failures: 2, Errors: 0, Skipped: 0, Time elapsed: 0.923 sec <<< FAILURE!
testGetFirst(org.n52.sos.soe.GetFirstGetLatestObservationTest)  Time elapsed: 0.513 sec  <<< FAILURE!
java.lang.AssertionError: Not a GetObservationResponse: class org.apache.xmlbeans.impl.values.XmlAnyTypeImpl
	at org.junit.Assert.fail(Assert.java:88)
	at org.junit.Assert.assertTrue(Assert.java:41)
	at org.n52.sos.soe.GetFirstGetLatestObservationTest.testGetFirst(GetFirstGetLatestObservationTest.java:44)
	at sun.reflect.NativeMethodAccessorImpl.invoke0(Native Method)
	at sun.reflect.NativeMethodAccessorImpl.invoke(NativeMethodAccessorImpl.java:57)
	at sun.reflect.DelegatingMethodAccessorImpl.invoke(DelegatingMethodAccessorImpl.java:43)
	at java.lang.reflect.Method.invoke(Method.java:606)
	at org.junit.runners.model.FrameworkMethod$1.runReflectiveCall(FrameworkMethod.java:47)
	at org.junit.internal.runners.model.ReflectiveCallable.run(ReflectiveCallable.java:12)
	at org.junit.runners.model.FrameworkMethod.invokeExplosively(FrameworkMethod.java:44)
	at org.junit.internal.runners.statements.InvokeMethod.evaluate(InvokeMethod.java:17)
	at org.junit.runners.ParentRunner.runLeaf(ParentRunner.java:271)
	at org.junit.runners.BlockJUnit4ClassRunner.runChild(BlockJUnit4ClassRunner.java:70)
	at org.junit.runners.BlockJUnit4ClassRunner.runChild(BlockJUnit4ClassRunner.java:50)
	at org.junit.runners.ParentRunner$3.run(ParentRunner.java:238)
	at org.junit.runners.ParentRunner$1.schedule(ParentRunner.java:63)
	at org.junit.runners.ParentRunner.runChildren(ParentRunner.java:236)
	at org.junit.runners.ParentRunner.access$000(ParentRunner.java:53)
	at org.junit.runners.ParentRunner$2.evaluate(ParentRunner.java:229)
	at org.junit.runners.ParentRunner.run(ParentRunner.java:309)
	at org.apache.maven.surefire.junit4.JUnit4Provider.execute(JUnit4Provider.java:252)
	at org.apache.maven.surefire.junit4.JUnit4Provider.executeTestSet(JUnit4Provider.java:141)
	at org.apache.maven.surefire.junit4.JUnit4Provider.invoke(JUnit4Provider.java:112)
	at sun.reflect.NativeMethodAccessorImpl.invoke0(Native Method)
	at sun.reflect.NativeMethodAccessorImpl.invoke(NativeMethodAccessorImpl.java:57)
	at sun.reflect.DelegatingMethodAccessorImpl.invoke(DelegatingMethodAccessorImpl.java:43)
	at java.lang.reflect.Method.invoke(Method.java:606)
	at org.apache.maven.surefire.util.ReflectionUtils.invokeMethodWithArray(ReflectionUtils.java:189)
	at org.apache.maven.surefire.booter.ProviderFactory$ProviderProxy.invoke(ProviderFactory.java:165)
	at org.apache.maven.surefire.booter.ProviderFactory.invokeProvider(ProviderFactory.java:85)
	at org.apache.maven.surefire.booter.ForkedBooter.runSuitesInProcess(ForkedBooter.java:115)
	at org.apache.maven.surefire.booter.ForkedBooter.main(ForkedBooter.java:75)

testGetLatest(org.n52.sos.soe.GetFirstGetLatestObservationTest)  Time elapsed: 0.055 sec  <<< FAILURE!
java.lang.AssertionError: Not a GetObservationResponse: class org.apache.xmlbeans.impl.values.XmlAnyTypeImpl
	at org.junit.Assert.fail(Assert.java:88)
	at org.junit.Assert.assertTrue(Assert.java:41)
	at org.n52.sos.soe.GetFirstGetLatestObservationTest.testGetLatest(GetFirstGetLatestObservationTest.java:68)
	at sun.reflect.NativeMethodAccessorImpl.invoke0(Native Method)
	at sun.reflect.NativeMethodAccessorImpl.invoke(NativeMethodAccessorImpl.java:57)
	at sun.reflect.DelegatingMethodAccessorImpl.invoke(DelegatingMethodAccessorImpl.java:43)
	at java.lang.reflect.Method.invoke(Method.java:606)
	at org.junit.runners.model.FrameworkMethod$1.runReflectiveCall(FrameworkMethod.java:47)
	at org.junit.internal.runners.model.ReflectiveCallable.run(ReflectiveCallable.java:12)
	at org.junit.runners.model.FrameworkMethod.invokeExplosively(FrameworkMethod.java:44)
	at org.junit.internal.runners.statements.InvokeMethod.evaluate(InvokeMethod.java:17)
	at org.junit.runners.ParentRunner.runLeaf(ParentRunner.java:271)
	at org.junit.runners.BlockJUnit4ClassRunner.runChild(BlockJUnit4ClassRunner.java:70)
	at org.junit.runners.BlockJUnit4ClassRunner.runChild(BlockJUnit4ClassRunner.java:50)
	at org.junit.runners.ParentRunner$3.run(ParentRunner.java:238)
	at org.junit.runners.ParentRunner$1.schedule(ParentRunner.java:63)
	at org.junit.runners.ParentRunner.runChildren(ParentRunner.java:236)
	at org.junit.runners.ParentRunner.access$000(ParentRunner.java:53)
	at org.junit.runners.ParentRunner$2.evaluate(ParentRunner.java:229)
	at org.junit.runners.ParentRunner.run(ParentRunner.java:309)
	at org.apache.maven.surefire.junit4.JUnit4Provider.execute(JUnit4Provider.java:252)
	at org.apache.maven.surefire.junit4.JUnit4Provider.executeTestSet(JUnit4Provider.java:141)
	at org.apache.maven.surefire.junit4.JUnit4Provider.invoke(JUnit4Provider.java:112)
	at sun.reflect.NativeMethodAccessorImpl.invoke0(Native Method)
	at sun.reflect.NativeMethodAccessorImpl.invoke(NativeMethodAccessorImpl.java:57)
	at sun.reflect.DelegatingMethodAccessorImpl.invoke(DelegatingMethodAccessorImpl.java:43)
	at java.lang.reflect.Method.invoke(Method.java:606)
	at org.apache.maven.surefire.util.ReflectionUtils.invokeMethodWithArray(ReflectionUtils.java:189)
	at org.apache.maven.surefire.booter.ProviderFactory$ProviderProxy.invoke(ProviderFactory.java:165)
	at org.apache.maven.surefire.booter.ProviderFactory.invokeProvider(ProviderFactory.java:85)
	at org.apache.maven.surefire.booter.ForkedBooter.runSuitesInProcess(ForkedBooter.java:115)
	at org.apache.maven.surefire.booter.ForkedBooter.main(ForkedBooter.java:75)

Running org.n52.sos.soe.GetFeatureOfInterestContentTest
2015-06-25 13:22:46,280 [main] INFO  org.n52.sos.soe.HttpUtil: http://ags.dev.52north.org:6080/arcgis/rest/services/EEA/Airquality_E/MapServer/exts/52nArcGisSos/
2015-06-25 13:22:46,286 [main] INFO  org.n52.sos.soe.HttpUtil: HTTP GET: http://ags.dev.52north.org:6080/arcgis/rest/services/EEA/Airquality_E/MapServer/exts/52nArcGisSos/GetFeatureOfInterest?service=SOS&version=2.0.0&request=GetFeatureOfInterest&featureOfInterest=http%3A%2F%2Fcdr.eionet.europa.eu%2Fhu%2Feu%2Faqd%2Fd%2Fenvut_vxq%2FREP_D-HU_OMSZ_20140122_D-001.xml%23SPO_F-HU0002R_00001_500_500&observedProperty=&procedure=&namespaces=&spatialFilter=&f=xml
2015-06-25 13:22:46,326 [main] INFO  org.n52.sos.soe.HttpUtil: Request latency: 40
2015-06-25 13:22:46,330 [main] INFO  org.n52.sos.soe.HttpUtil: http://ags.dev.52north.org:6080/arcgis/rest/services/EEA/Airquality_E/MapServer/exts/52nArcGisSos/
2015-06-25 13:22:46,340 [main] INFO  org.n52.sos.soe.HttpUtil: HTTP GET: http://ags.dev.52north.org:6080/arcgis/rest/services/EEA/Airquality_E/MapServer/exts/52nArcGisSos/GetFeatureOfInterest?service=SOS&version=2.0.0&request=GetFeatureOfInterest&featureOfInterest=&observedProperty=&procedure=NET-FI016A&namespaces=&spatialFilter=&f=xml
2015-06-25 13:22:46,377 [main] INFO  org.n52.sos.soe.HttpUtil: Request latency: 37
2015-06-25 13:22:46,381 [main] INFO  org.n52.sos.soe.HttpUtil: http://ags.dev.52north.org:6080/arcgis/rest/services/EEA/Airquality_E/MapServer/exts/52nArcGisSos/
2015-06-25 13:22:46,390 [main] INFO  org.n52.sos.soe.HttpUtil: HTTP GET: http://ags.dev.52north.org:6080/arcgis/rest/services/EEA/Airquality_E/MapServer/exts/52nArcGisSos/GetFeatureOfInterest?service=SOS&version=2.0.0&request=GetFeatureOfInterest&featureOfInterest=&observedProperty=&procedure=&namespaces=&spatialFilter=&f=xml
2015-06-25 13:22:46,426 [main] INFO  org.n52.sos.soe.HttpUtil: Request latency: 36
2015-06-25 13:22:46,431 [main] INFO  org.n52.sos.soe.HttpUtil: http://ags.dev.52north.org:6080/arcgis/rest/services/EEA/Airquality_E/MapServer/exts/52nArcGisSos/
2015-06-25 13:22:46,440 [main] INFO  org.n52.sos.soe.HttpUtil: HTTP GET: http://ags.dev.52north.org:6080/arcgis/rest/services/EEA/Airquality_E/MapServer/exts/52nArcGisSos/GetFeatureOfInterest?service=SOS&version=2.0.0&request=GetFeatureOfInterest&featureOfInterest=&observedProperty=&procedure=IamNotAProcedureAtAll&namespaces=&spatialFilter=&f=xml
2015-06-25 13:22:46,477 [main] INFO  org.n52.sos.soe.HttpUtil: Request latency: 37
Tests run: 4, Failures: 4, Errors: 0, Skipped: 0, Time elapsed: 0.195 sec <<< FAILURE!
instanceShouldReturnOneFeature(org.n52.sos.soe.GetFeatureOfInterestContentTest)  Time elapsed: 0.044 sec  <<< FAILURE!
java.lang.AssertionError: Not a GetFeatureOfInterestResponseDocument: class org.apache.xmlbeans.impl.values.XmlAnyTypeImpl
	at org.junit.Assert.fail(Assert.java:88)
	at org.junit.Assert.assertTrue(Assert.java:41)
	at org.n52.sos.soe.GetFeatureOfInterestContentTest.executeAndParseRequest(GetFeatureOfInterestContentTest.java:88)
	at org.n52.sos.soe.GetFeatureOfInterestContentTest.instanceShouldReturnOneFeature(GetFeatureOfInterestContentTest.java:76)
	at sun.reflect.NativeMethodAccessorImpl.invoke0(Native Method)
	at sun.reflect.NativeMethodAccessorImpl.invoke(NativeMethodAccessorImpl.java:57)
	at sun.reflect.DelegatingMethodAccessorImpl.invoke(DelegatingMethodAccessorImpl.java:43)
	at java.lang.reflect.Method.invoke(Method.java:606)
	at org.junit.runners.model.FrameworkMethod$1.runReflectiveCall(FrameworkMethod.java:47)
	at org.junit.internal.runners.model.ReflectiveCallable.run(ReflectiveCallable.java:12)
	at org.junit.runners.model.FrameworkMethod.invokeExplosively(FrameworkMethod.java:44)
	at org.junit.internal.runners.statements.InvokeMethod.evaluate(InvokeMethod.java:17)
	at org.junit.internal.runners.statements.RunBefores.evaluate(RunBefores.java:26)
	at org.junit.runners.ParentRunner.runLeaf(ParentRunner.java:271)
	at org.junit.runners.BlockJUnit4ClassRunner.runChild(BlockJUnit4ClassRunner.java:70)
	at org.junit.runners.BlockJUnit4ClassRunner.runChild(BlockJUnit4ClassRunner.java:50)
	at org.junit.runners.ParentRunner$3.run(ParentRunner.java:238)
	at org.junit.runners.ParentRunner$1.schedule(ParentRunner.java:63)
	at org.junit.runners.ParentRunner.runChildren(ParentRunner.java:236)
	at org.junit.runners.ParentRunner.access$000(ParentRunner.java:53)
	at org.junit.runners.ParentRunner$2.evaluate(ParentRunner.java:229)
	at org.junit.runners.ParentRunner.run(ParentRunner.java:309)
	at org.apache.maven.surefire.junit4.JUnit4Provider.execute(JUnit4Provider.java:252)
	at org.apache.maven.surefire.junit4.JUnit4Provider.executeTestSet(JUnit4Provider.java:141)
	at org.apache.maven.surefire.junit4.JUnit4Provider.invoke(JUnit4Provider.java:112)
	at sun.reflect.NativeMethodAccessorImpl.invoke0(Native Method)
	at sun.reflect.NativeMethodAccessorImpl.invoke(NativeMethodAccessorImpl.java:57)
	at sun.reflect.DelegatingMethodAccessorImpl.invoke(DelegatingMethodAccessorImpl.java:43)
	at java.lang.reflect.Method.invoke(Method.java:606)
	at org.apache.maven.surefire.util.ReflectionUtils.invokeMethodWithArray(ReflectionUtils.java:189)
	at org.apache.maven.surefire.booter.ProviderFactory$ProviderProxy.invoke(ProviderFactory.java:165)
	at org.apache.maven.surefire.booter.ProviderFactory.invokeProvider(ProviderFactory.java:85)
	at org.apache.maven.surefire.booter.ForkedBooter.runSuitesInProcess(ForkedBooter.java:115)
	at org.apache.maven.surefire.booter.ForkedBooter.main(ForkedBooter.java:75)

instanceShouldReturnFeaturesForNetwork(org.n52.sos.soe.GetFeatureOfInterestContentTest)  Time elapsed: 0.051 sec  <<< FAILURE!
java.lang.AssertionError: Not a GetFeatureOfInterestResponseDocument: class org.apache.xmlbeans.impl.values.XmlAnyTypeImpl
	at org.junit.Assert.fail(Assert.java:88)
	at org.junit.Assert.assertTrue(Assert.java:41)
	at org.n52.sos.soe.GetFeatureOfInterestContentTest.executeAndParseRequest(GetFeatureOfInterestContentTest.java:88)
	at org.n52.sos.soe.GetFeatureOfInterestContentTest.instanceShouldReturnFeaturesForNetwork(GetFeatureOfInterestContentTest.java:66)
	at sun.reflect.NativeMethodAccessorImpl.invoke0(Native Method)
	at sun.reflect.NativeMethodAccessorImpl.invoke(NativeMethodAccessorImpl.java:57)
	at sun.reflect.DelegatingMethodAccessorImpl.invoke(DelegatingMethodAccessorImpl.java:43)
	at java.lang.reflect.Method.invoke(Method.java:606)
	at org.junit.runners.model.FrameworkMethod$1.runReflectiveCall(FrameworkMethod.java:47)
	at org.junit.internal.runners.model.ReflectiveCallable.run(ReflectiveCallable.java:12)
	at org.junit.runners.model.FrameworkMethod.invokeExplosively(FrameworkMethod.java:44)
	at org.junit.internal.runners.statements.InvokeMethod.evaluate(InvokeMethod.java:17)
	at org.junit.internal.runners.statements.RunBefores.evaluate(RunBefores.java:26)
	at org.junit.runners.ParentRunner.runLeaf(ParentRunner.java:271)
	at org.junit.runners.BlockJUnit4ClassRunner.runChild(BlockJUnit4ClassRunner.java:70)
	at org.junit.runners.BlockJUnit4ClassRunner.runChild(BlockJUnit4ClassRunner.java:50)
	at org.junit.runners.ParentRunner$3.run(ParentRunner.java:238)
	at org.junit.runners.ParentRunner$1.schedule(ParentRunner.java:63)
	at org.junit.runners.ParentRunner.runChildren(ParentRunner.java:236)
	at org.junit.runners.ParentRunner.access$000(ParentRunner.java:53)
	at org.junit.runners.ParentRunner$2.evaluate(ParentRunner.java:229)
	at org.junit.runners.ParentRunner.run(ParentRunner.java:309)
	at org.apache.maven.surefire.junit4.JUnit4Provider.execute(JUnit4Provider.java:252)
	at org.apache.maven.surefire.junit4.JUnit4Provider.executeTestSet(JUnit4Provider.java:141)
	at org.apache.maven.surefire.junit4.JUnit4Provider.invoke(JUnit4Provider.java:112)
	at sun.reflect.NativeMethodAccessorImpl.invoke0(Native Method)
	at sun.reflect.NativeMethodAccessorImpl.invoke(NativeMethodAccessorImpl.java:57)
	at sun.reflect.DelegatingMethodAccessorImpl.invoke(DelegatingMethodAccessorImpl.java:43)
	at java.lang.reflect.Method.invoke(Method.java:606)
	at org.apache.maven.surefire.util.ReflectionUtils.invokeMethodWithArray(ReflectionUtils.java:189)
	at org.apache.maven.surefire.booter.ProviderFactory$ProviderProxy.invoke(ProviderFactory.java:165)
	at org.apache.maven.surefire.booter.ProviderFactory.invokeProvider(ProviderFactory.java:85)
	at org.apache.maven.surefire.booter.ForkedBooter.runSuitesInProcess(ForkedBooter.java:115)
	at org.apache.maven.surefire.booter.ForkedBooter.main(ForkedBooter.java:75)

instanceShouldReturnSizeLimitExceedsException(org.n52.sos.soe.GetFeatureOfInterestContentTest)  Time elapsed: 0.05 sec  <<< FAILURE!
java.lang.AssertionError: Not a ExceptionReportDocument: class org.apache.xmlbeans.impl.values.XmlAnyTypeImpl
	at org.junit.Assert.fail(Assert.java:88)
	at org.junit.Assert.assertTrue(Assert.java:41)
	at org.n52.sos.soe.GetFeatureOfInterestContentTest.instanceShouldReturnSizeLimitExceedsException(GetFeatureOfInterestContentTest.java:54)
	at sun.reflect.NativeMethodAccessorImpl.invoke0(Native Method)
	at sun.reflect.NativeMethodAccessorImpl.invoke(NativeMethodAccessorImpl.java:57)
	at sun.reflect.DelegatingMethodAccessorImpl.invoke(DelegatingMethodAccessorImpl.java:43)
	at java.lang.reflect.Method.invoke(Method.java:606)
	at org.junit.runners.model.FrameworkMethod$1.runReflectiveCall(FrameworkMethod.java:47)
	at org.junit.internal.runners.model.ReflectiveCallable.run(ReflectiveCallable.java:12)
	at org.junit.runners.model.FrameworkMethod.invokeExplosively(FrameworkMethod.java:44)
	at org.junit.internal.runners.statements.InvokeMethod.evaluate(InvokeMethod.java:17)
	at org.junit.internal.runners.statements.RunBefores.evaluate(RunBefores.java:26)
	at org.junit.runners.ParentRunner.runLeaf(ParentRunner.java:271)
	at org.junit.runners.BlockJUnit4ClassRunner.runChild(BlockJUnit4ClassRunner.java:70)
	at org.junit.runners.BlockJUnit4ClassRunner.runChild(BlockJUnit4ClassRunner.java:50)
	at org.junit.runners.ParentRunner$3.run(ParentRunner.java:238)
	at org.junit.runners.ParentRunner$1.schedule(ParentRunner.java:63)
	at org.junit.runners.ParentRunner.runChildren(ParentRunner.java:236)
	at org.junit.runners.ParentRunner.access$000(ParentRunner.java:53)
	at org.junit.runners.ParentRunner$2.evaluate(ParentRunner.java:229)
	at org.junit.runners.ParentRunner.run(ParentRunner.java:309)
	at org.apache.maven.surefire.junit4.JUnit4Provider.execute(JUnit4Provider.java:252)
	at org.apache.maven.surefire.junit4.JUnit4Provider.executeTestSet(JUnit4Provider.java:141)
	at org.apache.maven.surefire.junit4.JUnit4Provider.invoke(JUnit4Provider.java:112)
	at sun.reflect.NativeMethodAccessorImpl.invoke0(Native Method)
	at sun.reflect.NativeMethodAccessorImpl.invoke(NativeMethodAccessorImpl.java:57)
	at sun.reflect.DelegatingMethodAccessorImpl.invoke(DelegatingMethodAccessorImpl.java:43)
	at java.lang.reflect.Method.invoke(Method.java:606)
	at org.apache.maven.surefire.util.ReflectionUtils.invokeMethodWithArray(ReflectionUtils.java:189)
	at org.apache.maven.surefire.booter.ProviderFactory$ProviderProxy.invoke(ProviderFactory.java:165)
	at org.apache.maven.surefire.booter.ProviderFactory.invokeProvider(ProviderFactory.java:85)
	at org.apache.maven.surefire.booter.ForkedBooter.runSuitesInProcess(ForkedBooter.java:115)
	at org.apache.maven.surefire.booter.ForkedBooter.main(ForkedBooter.java:75)

instanceShouldReturnZeroFeatures(org.n52.sos.soe.GetFeatureOfInterestContentTest)  Time elapsed: 0.05 sec  <<< FAILURE!
java.lang.AssertionError: Not a GetFeatureOfInterestResponseDocument: class org.apache.xmlbeans.impl.values.XmlAnyTypeImpl
	at org.junit.Assert.fail(Assert.java:88)
	at org.junit.Assert.assertTrue(Assert.java:41)
	at org.n52.sos.soe.GetFeatureOfInterestContentTest.executeAndParseRequest(GetFeatureOfInterestContentTest.java:88)
	at org.n52.sos.soe.GetFeatureOfInterestContentTest.instanceShouldReturnZeroFeatures(GetFeatureOfInterestContentTest.java:43)
	at sun.reflect.NativeMethodAccessorImpl.invoke0(Native Method)
	at sun.reflect.NativeMethodAccessorImpl.invoke(NativeMethodAccessorImpl.java:57)
	at sun.reflect.DelegatingMethodAccessorImpl.invoke(DelegatingMethodAccessorImpl.java:43)
	at java.lang.reflect.Method.invoke(Method.java:606)
	at org.junit.runners.model.FrameworkMethod$1.runReflectiveCall(FrameworkMethod.java:47)
	at org.junit.internal.runners.model.ReflectiveCallable.run(ReflectiveCallable.java:12)
	at org.junit.runners.model.FrameworkMethod.invokeExplosively(FrameworkMethod.java:44)
	at org.junit.internal.runners.statements.InvokeMethod.evaluate(InvokeMethod.java:17)
	at org.junit.internal.runners.statements.RunBefores.evaluate(RunBefores.java:26)
	at org.junit.runners.ParentRunner.runLeaf(ParentRunner.java:271)
	at org.junit.runners.BlockJUnit4ClassRunner.runChild(BlockJUnit4ClassRunner.java:70)
	at org.junit.runners.BlockJUnit4ClassRunner.runChild(BlockJUnit4ClassRunner.java:50)
	at org.junit.runners.ParentRunner$3.run(ParentRunner.java:238)
	at org.junit.runners.ParentRunner$1.schedule(ParentRunner.java:63)
	at org.junit.runners.ParentRunner.runChildren(ParentRunner.java:236)
	at org.junit.runners.ParentRunner.access$000(ParentRunner.java:53)
	at org.junit.runners.ParentRunner$2.evaluate(ParentRunner.java:229)
	at org.junit.runners.ParentRunner.run(ParentRunner.java:309)
	at org.apache.maven.surefire.junit4.JUnit4Provider.execute(JUnit4Provider.java:252)
	at org.apache.maven.surefire.junit4.JUnit4Provider.executeTestSet(JUnit4Provider.java:141)
	at org.apache.maven.surefire.junit4.JUnit4Provider.invoke(JUnit4Provider.java:112)
	at sun.reflect.NativeMethodAccessorImpl.invoke0(Native Method)
	at sun.reflect.NativeMethodAccessorImpl.invoke(NativeMethodAccessorImpl.java:57)
	at sun.reflect.DelegatingMethodAccessorImpl.invoke(DelegatingMethodAccessorImpl.java:43)
	at java.lang.reflect.Method.invoke(Method.java:606)
	at org.apache.maven.surefire.util.ReflectionUtils.invokeMethodWithArray(ReflectionUtils.java:189)
	at org.apache.maven.surefire.booter.ProviderFactory$ProviderProxy.invoke(ProviderFactory.java:165)
	at org.apache.maven.surefire.booter.ProviderFactory.invokeProvider(ProviderFactory.java:85)
	at org.apache.maven.surefire.booter.ForkedBooter.runSuitesInProcess(ForkedBooter.java:115)
	at org.apache.maven.surefire.booter.ForkedBooter.main(ForkedBooter.java:75)

Running org.n52.sos.soe.GetObservationAQDTest
2015-06-25 13:22:46,484 [main] INFO  org.n52.sos.soe.HttpUtil: http://ags.dev.52north.org:6080/arcgis/rest/services/EEA/Airquality_E/MapServer/exts/52nArcGisSos/
2015-06-25 13:22:46,491 [main] INFO  org.n52.sos.soe.HttpUtil: HTTP GET: http://ags.dev.52north.org:6080/arcgis/rest/services/EEA/Airquality_E/MapServer/exts/52nArcGisSos/GetObservation?service=SOS&version=2.0.0&request=GetObservation&observedProperty=http%3A%2F%2Fdd.eionet.europa.eu%2Fvocabulary%2Faq%2Fpollutant%2F1&procedure=http%3A%2F%2Fcdr.eionet.europa.eu%2Fpl%2Feu%2Faqd%2Fd%2Fenvuvt6ea%2FPL_REPORT_D_FOR_2014v2.xml%23SPO_P_PL0518A_1_001&f=xml&responseFormat=http%3A%2F%2Faqd.ec.europa.eu%2Faqd%2F0.3.7c&temporalFilter=om:phenomenonTime,2014-02-01T00:00:00/2014-02-20T00:00:00
2015-06-25 13:22:46,525 [main] INFO  org.n52.sos.soe.HttpUtil: Request latency: 34
Tests run: 1, Failures: 1, Errors: 0, Skipped: 0, Time elapsed: 0.044 sec <<< FAILURE!
validateGetObservation(org.n52.sos.soe.GetObservationAQDTest)  Time elapsed: 0.044 sec  <<< FAILURE!
java.lang.AssertionError: Not a FeatureCollection: class org.apache.xmlbeans.impl.values.XmlAnyTypeImpl
	at org.junit.Assert.fail(Assert.java:88)
	at org.junit.Assert.assertTrue(Assert.java:41)
	at org.n52.sos.soe.GetObservationAQDTest.validateGetObservation(GetObservationAQDTest.java:55)
	at sun.reflect.NativeMethodAccessorImpl.invoke0(Native Method)
	at sun.reflect.NativeMethodAccessorImpl.invoke(NativeMethodAccessorImpl.java:57)
	at sun.reflect.DelegatingMethodAccessorImpl.invoke(DelegatingMethodAccessorImpl.java:43)
	at java.lang.reflect.Method.invoke(Method.java:606)
	at org.junit.runners.model.FrameworkMethod$1.runReflectiveCall(FrameworkMethod.java:47)
	at org.junit.internal.runners.model.ReflectiveCallable.run(ReflectiveCallable.java:12)
	at org.junit.runners.model.FrameworkMethod.invokeExplosively(FrameworkMethod.java:44)
	at org.junit.internal.runners.statements.InvokeMethod.evaluate(InvokeMethod.java:17)
	at org.junit.runners.ParentRunner.runLeaf(ParentRunner.java:271)
	at org.junit.runners.BlockJUnit4ClassRunner.runChild(BlockJUnit4ClassRunner.java:70)
	at org.junit.runners.BlockJUnit4ClassRunner.runChild(BlockJUnit4ClassRunner.java:50)
	at org.junit.runners.ParentRunner$3.run(ParentRunner.java:238)
	at org.junit.runners.ParentRunner$1.schedule(ParentRunner.java:63)
	at org.junit.runners.ParentRunner.runChildren(ParentRunner.java:236)
	at org.junit.runners.ParentRunner.access$000(ParentRunner.java:53)
	at org.junit.runners.ParentRunner$2.evaluate(ParentRunner.java:229)
	at org.junit.runners.ParentRunner.run(ParentRunner.java:309)
	at org.apache.maven.surefire.junit4.JUnit4Provider.execute(JUnit4Provider.java:252)
	at org.apache.maven.surefire.junit4.JUnit4Provider.executeTestSet(JUnit4Provider.java:141)
	at org.apache.maven.surefire.junit4.JUnit4Provider.invoke(JUnit4Provider.java:112)
	at sun.reflect.NativeMethodAccessorImpl.invoke0(Native Method)
	at sun.reflect.NativeMethodAccessorImpl.invoke(NativeMethodAccessorImpl.java:57)
	at sun.reflect.DelegatingMethodAccessorImpl.invoke(DelegatingMethodAccessorImpl.java:43)
	at java.lang.reflect.Method.invoke(Method.java:606)
	at org.apache.maven.surefire.util.ReflectionUtils.invokeMethodWithArray(ReflectionUtils.java:189)
	at org.apache.maven.surefire.booter.ProviderFactory$ProviderProxy.invoke(ProviderFactory.java:165)
	at org.apache.maven.surefire.booter.ProviderFactory.invokeProvider(ProviderFactory.java:85)
	at org.apache.maven.surefire.booter.ForkedBooter.runSuitesInProcess(ForkedBooter.java:115)
	at org.apache.maven.surefire.booter.ForkedBooter.main(ForkedBooter.java:75)

Running org.n52.sos.soe.GetCapabilitiesValidationTest
2015-06-25 13:22:46,532 [main] INFO  org.n52.sos.soe.HttpUtil: http://ags.dev.52north.org:6080/arcgis/rest/services/EEA/Airquality_E/MapServer/exts/52nArcGisSos/
2015-06-25 13:22:46,540 [main] INFO  org.n52.sos.soe.HttpUtil: HTTP GET: http://ags.dev.52north.org:6080/arcgis/rest/services/EEA/Airquality_E/MapServer/exts/52nArcGisSos/GetCapabilities?service=SOS&request=GetCapabilities&f=xml
2015-06-25 13:22:46,590 [main] INFO  org.n52.sos.soe.HttpUtil: Request latency: 50
Tests run: 1, Failures: 1, Errors: 0, Skipped: 0, Time elapsed: 0.057 sec <<< FAILURE!
validateCapabilities(org.n52.sos.soe.GetCapabilitiesValidationTest)  Time elapsed: 0.057 sec  <<< FAILURE!
java.lang.AssertionError: Not a Capabilities doc:class org.apache.xmlbeans.impl.values.XmlAnyTypeImpl
	at org.junit.Assert.fail(Assert.java:88)
	at org.junit.Assert.assertTrue(Assert.java:41)
	at org.n52.sos.soe.GetCapabilitiesValidationTest.validateCapabilities(GetCapabilitiesValidationTest.java:52)
	at sun.reflect.NativeMethodAccessorImpl.invoke0(Native Method)
	at sun.reflect.NativeMethodAccessorImpl.invoke(NativeMethodAccessorImpl.java:57)
	at sun.reflect.DelegatingMethodAccessorImpl.invoke(DelegatingMethodAccessorImpl.java:43)
	at java.lang.reflect.Method.invoke(Method.java:606)
	at org.junit.runners.model.FrameworkMethod$1.runReflectiveCall(FrameworkMethod.java:47)
	at org.junit.internal.runners.model.ReflectiveCallable.run(ReflectiveCallable.java:12)
	at org.junit.runners.model.FrameworkMethod.invokeExplosively(FrameworkMethod.java:44)
	at org.junit.internal.runners.statements.InvokeMethod.evaluate(InvokeMethod.java:17)
	at org.junit.runners.ParentRunner.runLeaf(ParentRunner.java:271)
	at org.junit.runners.BlockJUnit4ClassRunner.runChild(BlockJUnit4ClassRunner.java:70)
	at org.junit.runners.BlockJUnit4ClassRunner.runChild(BlockJUnit4ClassRunner.java:50)
	at org.junit.runners.ParentRunner$3.run(ParentRunner.java:238)
	at org.junit.runners.ParentRunner$1.schedule(ParentRunner.java:63)
	at org.junit.runners.ParentRunner.runChildren(ParentRunner.java:236)
	at org.junit.runners.ParentRunner.access$000(ParentRunner.java:53)
	at org.junit.runners.ParentRunner$2.evaluate(ParentRunner.java:229)
	at org.junit.runners.ParentRunner.run(ParentRunner.java:309)
	at org.apache.maven.surefire.junit4.JUnit4Provider.execute(JUnit4Provider.java:252)
	at org.apache.maven.surefire.junit4.JUnit4Provider.executeTestSet(JUnit4Provider.java:141)
	at org.apache.maven.surefire.junit4.JUnit4Provider.invoke(JUnit4Provider.java:112)
	at sun.reflect.NativeMethodAccessorImpl.invoke0(Native Method)
	at sun.reflect.NativeMethodAccessorImpl.invoke(NativeMethodAccessorImpl.java:57)
	at sun.reflect.DelegatingMethodAccessorImpl.invoke(DelegatingMethodAccessorImpl.java:43)
	at java.lang.reflect.Method.invoke(Method.java:606)
	at org.apache.maven.surefire.util.ReflectionUtils.invokeMethodWithArray(ReflectionUtils.java:189)
	at org.apache.maven.surefire.booter.ProviderFactory$ProviderProxy.invoke(ProviderFactory.java:165)
	at org.apache.maven.surefire.booter.ProviderFactory.invokeProvider(ProviderFactory.java:85)
	at org.apache.maven.surefire.booter.ForkedBooter.runSuitesInProcess(ForkedBooter.java:115)
	at org.apache.maven.surefire.booter.ForkedBooter.main(ForkedBooter.java:75)

Running org.n52.sos.soe.GetCacheMetadataTest
2015-06-25 13:22:46,597 [main] INFO  org.n52.sos.soe.HttpUtil: http://ags.dev.52north.org:6080/arcgis/rest/services/EEA/Airquality_E/MapServer/exts/52nArcGisSos/
2015-06-25 13:22:46,718 [main] INFO  org.n52.sos.soe.HttpUtil: HTTP GET: http://ags.dev.52north.org:6080/arcgis/rest/services/EEA/Airquality_E/MapServer/exts/52nArcGisSos/GetCacheMetadata?service=SOS&version=2.0.0&request=GetCacheMetadata&f=json
2015-06-25 13:22:46,753 [main] INFO  org.n52.sos.soe.HttpUtil: Request latency: 35
2015-06-25 13:22:46,788 [main] INFO  org.n52.sos.soe.GetCacheMetadataTest: {"error":{"code":500,"message":"Error handling service request : Could not find a service with the name 'EEA/MapServer/Airquality_E' in the configured clusters. Service may be stopped or ArcGIS Server may not be running.","details":[]}}
Tests run: 1, Failures: 0, Errors: 1, Skipped: 0, Time elapsed: 0.196 sec <<< FAILURE!
validateGetCacheMetadata(org.n52.sos.soe.GetCacheMetadataTest)  Time elapsed: 0.195 sec  <<< ERROR!
java.lang.NullPointerException
	at org.n52.sos.soe.GetCacheMetadataTest.validateLatestExecution(GetCacheMetadataTest.java:56)
	at org.n52.sos.soe.GetCacheMetadataTest.validateGetCacheMetadata(GetCacheMetadataTest.java:47)
	at sun.reflect.NativeMethodAccessorImpl.invoke0(Native Method)
	at sun.reflect.NativeMethodAccessorImpl.invoke(NativeMethodAccessorImpl.java:57)
	at sun.reflect.DelegatingMethodAccessorImpl.invoke(DelegatingMethodAccessorImpl.java:43)
	at java.lang.reflect.Method.invoke(Method.java:606)
	at org.junit.runners.model.FrameworkMethod$1.runReflectiveCall(FrameworkMethod.java:47)
	at org.junit.internal.runners.model.ReflectiveCallable.run(ReflectiveCallable.java:12)
	at org.junit.runners.model.FrameworkMethod.invokeExplosively(FrameworkMethod.java:44)
	at org.junit.internal.runners.statements.InvokeMethod.evaluate(InvokeMethod.java:17)
	at org.junit.runners.ParentRunner.runLeaf(ParentRunner.java:271)
	at org.junit.runners.BlockJUnit4ClassRunner.runChild(BlockJUnit4ClassRunner.java:70)
	at org.junit.runners.BlockJUnit4ClassRunner.runChild(BlockJUnit4ClassRunner.java:50)
	at org.junit.runners.ParentRunner$3.run(ParentRunner.java:238)
	at org.junit.runners.ParentRunner$1.schedule(ParentRunner.java:63)
	at org.junit.runners.ParentRunner.runChildren(ParentRunner.java:236)
	at org.junit.runners.ParentRunner.access$000(ParentRunner.java:53)
	at org.junit.runners.ParentRunner$2.evaluate(ParentRunner.java:229)
	at org.junit.runners.ParentRunner.run(ParentRunner.java:309)
	at org.apache.maven.surefire.junit4.JUnit4Provider.execute(JUnit4Provider.java:252)
	at org.apache.maven.surefire.junit4.JUnit4Provider.executeTestSet(JUnit4Provider.java:141)
	at org.apache.maven.surefire.junit4.JUnit4Provider.invoke(JUnit4Provider.java:112)
	at sun.reflect.NativeMethodAccessorImpl.invoke0(Native Method)
	at sun.reflect.NativeMethodAccessorImpl.invoke(NativeMethodAccessorImpl.java:57)
	at sun.reflect.DelegatingMethodAccessorImpl.invoke(DelegatingMethodAccessorImpl.java:43)
	at java.lang.reflect.Method.invoke(Method.java:606)
	at org.apache.maven.surefire.util.ReflectionUtils.invokeMethodWithArray(ReflectionUtils.java:189)
	at org.apache.maven.surefire.booter.ProviderFactory$ProviderProxy.invoke(ProviderFactory.java:165)
	at org.apache.maven.surefire.booter.ProviderFactory.invokeProvider(ProviderFactory.java:85)
	at org.apache.maven.surefire.booter.ForkedBooter.runSuitesInProcess(ForkedBooter.java:115)
	at org.apache.maven.surefire.booter.ForkedBooter.main(ForkedBooter.java:75)

Running org.n52.sos.soe.DescribeSensorTest
2015-06-25 13:22:46,794 [main] INFO  org.n52.sos.soe.HttpUtil: http://ags.dev.52north.org:6080/arcgis/rest/services/EEA/Airquality_E/MapServer/exts/52nArcGisSos/
2015-06-25 13:22:46,799 [main] INFO  org.n52.sos.soe.HttpUtil: HTTP GET: http://ags.dev.52north.org:6080/arcgis/rest/services/EEA/Airquality_E/MapServer/exts/52nArcGisSos/DescribeSensor?service=SOS&version=2.0.0&request=DescribeSensor&procedure=NET-FI016A&procedureDescriptionFormat=http://www.opengis.net/sensorML/1.0.1&f=xml
2015-06-25 13:22:46,835 [main] INFO  org.n52.sos.soe.HttpUtil: Request latency: 36
Tests run: 1, Failures: 1, Errors: 0, Skipped: 0, Time elapsed: 0.044 sec <<< FAILURE!
validateDescribeSensor(org.n52.sos.soe.DescribeSensorTest)  Time elapsed: 0.044 sec  <<< FAILURE!
java.lang.AssertionError: Not a DescribeSensorResponse: class org.apache.xmlbeans.impl.values.XmlAnyTypeImpl
	at org.junit.Assert.fail(Assert.java:88)
	at org.junit.Assert.assertTrue(Assert.java:41)
	at org.n52.sos.soe.DescribeSensorTest.validateDescribeSensor(DescribeSensorTest.java:49)
	at sun.reflect.NativeMethodAccessorImpl.invoke0(Native Method)
	at sun.reflect.NativeMethodAccessorImpl.invoke(NativeMethodAccessorImpl.java:57)
	at sun.reflect.DelegatingMethodAccessorImpl.invoke(DelegatingMethodAccessorImpl.java:43)
	at java.lang.reflect.Method.invoke(Method.java:606)
	at org.junit.runners.model.FrameworkMethod$1.runReflectiveCall(FrameworkMethod.java:47)
	at org.junit.internal.runners.model.ReflectiveCallable.run(ReflectiveCallable.java:12)
	at org.junit.runners.model.FrameworkMethod.invokeExplosively(FrameworkMethod.java:44)
	at org.junit.internal.runners.statements.InvokeMethod.evaluate(InvokeMethod.java:17)
	at org.junit.runners.ParentRunner.runLeaf(ParentRunner.java:271)
	at org.junit.runners.BlockJUnit4ClassRunner.runChild(BlockJUnit4ClassRunner.java:70)
	at org.junit.runners.BlockJUnit4ClassRunner.runChild(BlockJUnit4ClassRunner.java:50)
	at org.junit.runners.ParentRunner$3.run(ParentRunner.java:238)
	at org.junit.runners.ParentRunner$1.schedule(ParentRunner.java:63)
	at org.junit.runners.ParentRunner.runChildren(ParentRunner.java:236)
	at org.junit.runners.ParentRunner.access$000(ParentRunner.java:53)
	at org.junit.runners.ParentRunner$2.evaluate(ParentRunner.java:229)
	at org.junit.runners.ParentRunner.run(ParentRunner.java:309)
	at org.apache.maven.surefire.junit4.JUnit4Provider.execute(JUnit4Provider.java:252)
	at org.apache.maven.surefire.junit4.JUnit4Provider.executeTestSet(JUnit4Provider.java:141)
	at org.apache.maven.surefire.junit4.JUnit4Provider.invoke(JUnit4Provider.java:112)
	at sun.reflect.NativeMethodAccessorImpl.invoke0(Native Method)
	at sun.reflect.NativeMethodAccessorImpl.invoke(NativeMethodAccessorImpl.java:57)
	at sun.reflect.DelegatingMethodAccessorImpl.invoke(DelegatingMethodAccessorImpl.java:43)
	at java.lang.reflect.Method.invoke(Method.java:606)
	at org.apache.maven.surefire.util.ReflectionUtils.invokeMethodWithArray(ReflectionUtils.java:189)
	at org.apache.maven.surefire.booter.ProviderFactory$ProviderProxy.invoke(ProviderFactory.java:165)
	at org.apache.maven.surefire.booter.ProviderFactory.invokeProvider(ProviderFactory.java:85)
	at org.apache.maven.surefire.booter.ForkedBooter.runSuitesInProcess(ForkedBooter.java:115)
	at org.apache.maven.surefire.booter.ForkedBooter.main(ForkedBooter.java:75)

Running org.n52.sos.soe.GetFeatureOfInterestTest
2015-06-25 13:22:46,840 [main] INFO  org.n52.sos.soe.HttpUtil: http://ags.dev.52north.org:6080/arcgis/rest/services/EEA/Airquality_E/MapServer/exts/52nArcGisSos/
2015-06-25 13:22:46,849 [main] INFO  org.n52.sos.soe.HttpUtil: HTTP GET: http://ags.dev.52north.org:6080/arcgis/rest/services/EEA/Airquality_E/MapServer/exts/52nArcGisSos/GetFeatureOfInterest?service=SOS&version=2.0.0&request=GetFeatureOfInterest&featureOfInterest=http%3A%2F%2Fcdr.eionet.europa.eu%2Fhu%2Feu%2Faqd%2Fd%2Fenvut_vxq%2FREP_D-HU_OMSZ_20140122_D-001.xml%23SPO_F-HU0002R_00001_500_500&observedProperty=&procedure=&namespaces=&spatialFilter=&f=xml
2015-06-25 13:22:46,888 [main] INFO  org.n52.sos.soe.HttpUtil: Request latency: 39
Tests run: 1, Failures: 1, Errors: 0, Skipped: 0, Time elapsed: 0.05 sec <<< FAILURE!
validateGetFOI(org.n52.sos.soe.GetFeatureOfInterestTest)  Time elapsed: 0.05 sec  <<< FAILURE!
java.lang.AssertionError: Not a GetFeatureOfInterest Reponse: class org.apache.xmlbeans.impl.values.XmlAnyTypeImpl
	at org.junit.Assert.fail(Assert.java:88)
	at org.junit.Assert.assertTrue(Assert.java:41)
	at org.n52.sos.soe.GetFeatureOfInterestTest.validateGetFOI(GetFeatureOfInterestTest.java:59)
	at sun.reflect.NativeMethodAccessorImpl.invoke0(Native Method)
	at sun.reflect.NativeMethodAccessorImpl.invoke(NativeMethodAccessorImpl.java:57)
	at sun.reflect.DelegatingMethodAccessorImpl.invoke(DelegatingMethodAccessorImpl.java:43)
	at java.lang.reflect.Method.invoke(Method.java:606)
	at org.junit.runners.model.FrameworkMethod$1.runReflectiveCall(FrameworkMethod.java:47)
	at org.junit.internal.runners.model.ReflectiveCallable.run(ReflectiveCallable.java:12)
	at org.junit.runners.model.FrameworkMethod.invokeExplosively(FrameworkMethod.java:44)
	at org.junit.internal.runners.statements.InvokeMethod.evaluate(InvokeMethod.java:17)
	at org.junit.runners.ParentRunner.runLeaf(ParentRunner.java:271)
	at org.junit.runners.BlockJUnit4ClassRunner.runChild(BlockJUnit4ClassRunner.java:70)
	at org.junit.runners.BlockJUnit4ClassRunner.runChild(BlockJUnit4ClassRunner.java:50)
	at org.junit.runners.ParentRunner$3.run(ParentRunner.java:238)
	at org.junit.runners.ParentRunner$1.schedule(ParentRunner.java:63)
	at org.junit.runners.ParentRunner.runChildren(ParentRunner.java:236)
	at org.junit.runners.ParentRunner.access$000(ParentRunner.java:53)
	at org.junit.runners.ParentRunner$2.evaluate(ParentRunner.java:229)
	at org.junit.runners.ParentRunner.run(ParentRunner.java:309)
	at org.apache.maven.surefire.junit4.JUnit4Provider.execute(JUnit4Provider.java:252)
	at org.apache.maven.surefire.junit4.JUnit4Provider.executeTestSet(JUnit4Provider.java:141)
	at org.apache.maven.surefire.junit4.JUnit4Provider.invoke(JUnit4Provider.java:112)
	at sun.reflect.NativeMethodAccessorImpl.invoke0(Native Method)
	at sun.reflect.NativeMethodAccessorImpl.invoke(NativeMethodAccessorImpl.java:57)
	at sun.reflect.DelegatingMethodAccessorImpl.invoke(DelegatingMethodAccessorImpl.java:43)
	at java.lang.reflect.Method.invoke(Method.java:606)
	at org.apache.maven.surefire.util.ReflectionUtils.invokeMethodWithArray(ReflectionUtils.java:189)
	at org.apache.maven.surefire.booter.ProviderFactory$ProviderProxy.invoke(ProviderFactory.java:165)
	at org.apache.maven.surefire.booter.ProviderFactory.invokeProvider(ProviderFactory.java:85)
	at org.apache.maven.surefire.booter.ForkedBooter.runSuitesInProcess(ForkedBooter.java:115)
	at org.apache.maven.surefire.booter.ForkedBooter.main(ForkedBooter.java:75)

Running org.n52.sos.soe.GetObservationTest
2015-06-25 13:22:46,893 [main] INFO  org.n52.sos.soe.HttpUtil: http://ags.dev.52north.org:6080/arcgis/rest/services/EEA/Airquality_E/MapServer/exts/52nArcGisSos/
2015-06-25 13:22:46,900 [main] INFO  org.n52.sos.soe.HttpUtil: HTTP GET: http://ags.dev.52north.org:6080/arcgis/rest/services/EEA/Airquality_E/MapServer/exts/52nArcGisSos/GetObservation?service=SOS&version=2.0.0&request=GetObservation&observedProperty=http%3A%2F%2Fdd.eionet.europa.eu%2Fvocabulary%2Faq%2Fpollutant%2F1&procedure=http%3A%2F%2Fcdr.eionet.europa.eu%2Fpl%2Feu%2Faqd%2Fd%2Fenvuvt6ea%2FPL_REPORT_D_FOR_2014v2.xml%23SPO_P_PL0518A_1_001&f=xml&temporalFilter=om:phenomenonTime,2014-02-01T00:00:00/2014-02-20T00:00:00
2015-06-25 13:22:46,999 [main] INFO  org.n52.sos.soe.HttpUtil: Request latency: 99
Tests run: 1, Failures: 1, Errors: 0, Skipped: 0, Time elapsed: 0.109 sec <<< FAILURE!
validateGetObservation(org.n52.sos.soe.GetObservationTest)  Time elapsed: 0.109 sec  <<< FAILURE!
java.lang.AssertionError: Not a GetObservationResponse: class org.apache.xmlbeans.impl.values.XmlAnyTypeImpl
	at org.junit.Assert.fail(Assert.java:88)
	at org.junit.Assert.assertTrue(Assert.java:41)
	at org.n52.sos.soe.GetObservationTest.validateGetObservation(GetObservationTest.java:52)
	at sun.reflect.NativeMethodAccessorImpl.invoke0(Native Method)
	at sun.reflect.NativeMethodAccessorImpl.invoke(NativeMethodAccessorImpl.java:57)
	at sun.reflect.DelegatingMethodAccessorImpl.invoke(DelegatingMethodAccessorImpl.java:43)
	at java.lang.reflect.Method.invoke(Method.java:606)
	at org.junit.runners.model.FrameworkMethod$1.runReflectiveCall(FrameworkMethod.java:47)
	at org.junit.internal.runners.model.ReflectiveCallable.run(ReflectiveCallable.java:12)
	at org.junit.runners.model.FrameworkMethod.invokeExplosively(FrameworkMethod.java:44)
	at org.junit.internal.runners.statements.InvokeMethod.evaluate(InvokeMethod.java:17)
	at org.junit.runners.ParentRunner.runLeaf(ParentRunner.java:271)
	at org.junit.runners.BlockJUnit4ClassRunner.runChild(BlockJUnit4ClassRunner.java:70)
	at org.junit.runners.BlockJUnit4ClassRunner.runChild(BlockJUnit4ClassRunner.java:50)
	at org.junit.runners.ParentRunner$3.run(ParentRunner.java:238)
	at org.junit.runners.ParentRunner$1.schedule(ParentRunner.java:63)
	at org.junit.runners.ParentRunner.runChildren(ParentRunner.java:236)
	at org.junit.runners.ParentRunner.access$000(ParentRunner.java:53)
	at org.junit.runners.ParentRunner$2.evaluate(ParentRunner.java:229)
	at org.junit.runners.ParentRunner.run(ParentRunner.java:309)
	at org.apache.maven.surefire.junit4.JUnit4Provider.execute(JUnit4Provider.java:252)
	at org.apache.maven.surefire.junit4.JUnit4Provider.executeTestSet(JUnit4Provider.java:141)
	at org.apache.maven.surefire.junit4.JUnit4Provider.invoke(JUnit4Provider.java:112)
	at sun.reflect.NativeMethodAccessorImpl.invoke0(Native Method)
	at sun.reflect.NativeMethodAccessorImpl.invoke(NativeMethodAccessorImpl.java:57)
	at sun.reflect.DelegatingMethodAccessorImpl.invoke(DelegatingMethodAccessorImpl.java:43)
	at java.lang.reflect.Method.invoke(Method.java:606)
	at org.apache.maven.surefire.util.ReflectionUtils.invokeMethodWithArray(ReflectionUtils.java:189)
	at org.apache.maven.surefire.booter.ProviderFactory$ProviderProxy.invoke(ProviderFactory.java:165)
	at org.apache.maven.surefire.booter.ProviderFactory.invokeProvider(ProviderFactory.java:85)
	at org.apache.maven.surefire.booter.ForkedBooter.runSuitesInProcess(ForkedBooter.java:115)
	at org.apache.maven.surefire.booter.ForkedBooter.main(ForkedBooter.java:75)


Results :

Failed tests:   testGetFirst(org.n52.sos.soe.GetFirstGetLatestObservationTest): Not a GetObservationResponse: class org.apache.xmlbeans.impl.values.XmlAnyTypeImpl
  testGetLatest(org.n52.sos.soe.GetFirstGetLatestObservationTest): Not a GetObservationResponse: class org.apache.xmlbeans.impl.values.XmlAnyTypeImpl
  instanceShouldReturnOneFeature(org.n52.sos.soe.GetFeatureOfInterestContentTest): Not a GetFeatureOfInterestResponseDocument: class org.apache.xmlbeans.impl.values.XmlAnyTypeImpl
  instanceShouldReturnFeaturesForNetwork(org.n52.sos.soe.GetFeatureOfInterestContentTest): Not a GetFeatureOfInterestResponseDocument: class org.apache.xmlbeans.impl.values.XmlAnyTypeImpl
  instanceShouldReturnSizeLimitExceedsException(org.n52.sos.soe.GetFeatureOfInterestContentTest): Not a ExceptionReportDocument: class org.apache.xmlbeans.impl.values.XmlAnyTypeImpl
  instanceShouldReturnZeroFeatures(org.n52.sos.soe.GetFeatureOfInterestContentTest): Not a GetFeatureOfInterestResponseDocument: class org.apache.xmlbeans.impl.values.XmlAnyTypeImpl
  validateGetObservation(org.n52.sos.soe.GetObservationAQDTest): Not a FeatureCollection: class org.apache.xmlbeans.impl.values.XmlAnyTypeImpl
  validateCapabilities(org.n52.sos.soe.GetCapabilitiesValidationTest): Not a Capabilities doc:class org.apache.xmlbeans.impl.values.XmlAnyTypeImpl
  validateDescribeSensor(org.n52.sos.soe.DescribeSensorTest): Not a DescribeSensorResponse: class org.apache.xmlbeans.impl.values.XmlAnyTypeImpl
  validateGetFOI(org.n52.sos.soe.GetFeatureOfInterestTest): Not a GetFeatureOfInterest Reponse: class org.apache.xmlbeans.impl.values.XmlAnyTypeImpl
  validateGetObservation(org.n52.sos.soe.GetObservationTest): Not a GetObservationResponse: class org.apache.xmlbeans.impl.values.XmlAnyTypeImpl

Tests in error: 
  validateGetCacheMetadata(org.n52.sos.soe.GetCacheMetadataTest)

Tests run: 12, Failures: 11, Errors: 1, Skipped: 0

[ERROR] There are test failures.

Please refer to /var/lib/jenkins/workspace/SOS-SOE ags.dev validation+integration test/execution/target/surefire-reports for the individual test results.
[JENKINS] Recording test results
log4j:WARN No appenders could be found for logger (org.apache.commons.beanutils.converters.BooleanConverter).
log4j:WARN Please initialize the log4j system properly.
[INFO] 
[INFO] --- maven-jar-plugin:2.4:jar (default-jar) @ SOS-SOE-it-execution ---
[WARNING] JAR will be empty - no content was marked for inclusion!
[INFO] Building jar: /var/lib/jenkins/workspace/SOS-SOE ags.dev validation+integration test/execution/target/SOS-SOE-it-execution-1.0.0-SNAPSHOT.jar
[INFO] 
[INFO] --- maven-install-plugin:2.4:install (default-install) @ SOS-SOE-it-execution ---
[INFO] Installing /var/lib/jenkins/workspace/SOS-SOE ags.dev validation+integration test/execution/target/SOS-SOE-it-execution-1.0.0-SNAPSHOT.jar to /var/lib/jenkins/.m2/repository/org/n52/sensorweb/SOS-SOE-it-execution/1.0.0-SNAPSHOT/SOS-SOE-it-execution-1.0.0-SNAPSHOT.jar
[INFO] Installing /var/lib/jenkins/workspace/SOS-SOE ags.dev validation+integration test/execution/pom.xml to /var/lib/jenkins/.m2/repository/org/n52/sensorweb/SOS-SOE-it-execution/1.0.0-SNAPSHOT/SOS-SOE-it-execution-1.0.0-SNAPSHOT.pom
[INFO] ------------------------------------------------------------------------
[INFO] Reactor Summary:
[INFO] 
[INFO] Integration Tests for the ArcGIS-Server-SOS-Extension  SUCCESS [  2.009 s]
[INFO] SOS-SOE-it-bindings ............................... SUCCESS [ 18.979 s]
[INFO] SOS-SOE-it-execution .............................. SUCCESS [  6.205 s]
[INFO] ------------------------------------------------------------------------
[INFO] BUILD SUCCESS
[INFO] ------------------------------------------------------------------------
[INFO] Total time: 29.615 s
[INFO] Finished at: 2015-06-25T13:22:50+00:00
[INFO] Final Memory: 36M/591M
[INFO] ------------------------------------------------------------------------
[JENKINS] Archiving /var/lib/jenkins/workspace/SOS-SOE ags.dev validation+integration test/binding/pom.xml to org.n52.sensorweb/SOS-SOE-it-bindings/1.0.0-SNAPSHOT/SOS-SOE-it-bindings-1.0.0-SNAPSHOT.pom
[JENKINS] Archiving /var/lib/jenkins/workspace/SOS-SOE ags.dev validation+integration test/binding/target/SOS-SOE-it-bindings-1.0.0-SNAPSHOT.jar to org.n52.sensorweb/SOS-SOE-it-bindings/1.0.0-SNAPSHOT/SOS-SOE-it-bindings-1.0.0-SNAPSHOT.jar
[JENKINS] Archiving /var/lib/jenkins/workspace/SOS-SOE ags.dev validation+integration test/pom.xml to org.n52.sensorweb/SOS-SOE-it/1.0.0-SNAPSHOT/SOS-SOE-it-1.0.0-SNAPSHOT.pom
[JENKINS] Archiving /var/lib/jenkins/workspace/SOS-SOE ags.dev validation+integration test/execution/pom.xml to org.n52.sensorweb/SOS-SOE-it-execution/1.0.0-SNAPSHOT/SOS-SOE-it-execution-1.0.0-SNAPSHOT.pom
[JENKINS] Archiving /var/lib/jenkins/workspace/SOS-SOE ags.dev validation+integration test/execution/target/SOS-SOE-it-execution-1.0.0-SNAPSHOT.jar to org.n52.sensorweb/SOS-SOE-it-execution/1.0.0-SNAPSHOT/SOS-SOE-it-execution-1.0.0-SNAPSHOT.jar
channel stopped
Finished: UNSTABLE