Console Output

Started by user BenjaminPross
Building in workspace /var/lib/jenkins/workspace/Moving-Code-Runtime-RELEASE
 > git rev-parse --is-inside-work-tree # timeout=10
Fetching changes from the remote Git repository
 > git config remote.origin.url ssh://git@github.com/52North/movingcode.git # timeout=10
Fetching upstream changes from ssh://git@github.com/52North/movingcode.git
 > git --version # timeout=10
 > git -c core.askpass=true fetch --tags --progress ssh://git@github.com/52North/movingcode.git +refs/heads/master:refs/remotes/origin/master
 > git rev-parse origin/master^{commit} # timeout=10
Checking out Revision a4152a3b02ab70e4a4095303efb9e526dd21c7c9 (origin/master)
 > git config core.sparsecheckout # timeout=10
 > git checkout -f a4152a3b02ab70e4a4095303efb9e526dd21c7c9
 > git rev-list a4152a3b02ab70e4a4095303efb9e526dd21c7c9 # timeout=10
Parsing POMs
Modules changed, recalculating dependency graph
Established TCP socket on 49491
[Moving-Code-Runtime-RELEASE] $ java -Xmx1024m -XX:MaxPermSize=1024m -cp /var/lib/jenkins/plugins/maven-plugin/WEB-INF/lib/maven3-agent-1.7.jar:/var/lib/jenkins/tools/hudson.tasks.Maven_MavenInstallation/Maven_3.0.x/boot/plexus-classworlds-2.4.jar org.jvnet.hudson.maven3.agent.Maven3Main /var/lib/jenkins/tools/hudson.tasks.Maven_MavenInstallation/Maven_3.0.x /var/cache/jenkins/war/WEB-INF/lib/remoting-2.56.jar /var/lib/jenkins/plugins/maven-plugin/WEB-INF/lib/maven3-interceptor-1.7.jar /var/lib/jenkins/plugins/maven-plugin/WEB-INF/lib/maven3-interceptor-commons-1.7.jar 49491
Java HotSpot(TM) 64-Bit Server VM warning: ignoring option MaxPermSize=1024m; support was removed in 8.0
<===[JENKINS REMOTING CAPACITY]===>channel started
Executing Maven:  -B -f /var/lib/jenkins/workspace/Moving-Code-Runtime-RELEASE/pom.xml -DdevelopmentVersion=1.2-SNAPSHOT -DreleaseVersion=1.1 -Dresume=false release:prepare release:perform -Denv=release
[INFO] Scanning for projects...
[INFO] ------------------------------------------------------------------------
[INFO] Reactor Build Order:
[INFO] 
[INFO] Moving Code Framework
[INFO] Moving Code XML Schema
[INFO] Moving Code Runtime
[INFO] Code Package Feed
[INFO]                                                                         
[INFO] ------------------------------------------------------------------------
[INFO] Building Moving Code Framework 1.1-SNAPSHOT
[INFO] ------------------------------------------------------------------------
[INFO] 
[INFO] --- maven-release-plugin:2.1:prepare (default-cli) @ movingcode-parent ---
[INFO] Verifying that there are no local modifications...
[INFO]   ignoring changes on: pom.xml.next, pom.xml.releaseBackup, pom.xml.tag, pom.xml.backup, pom.xml.branch, release.properties
[INFO] Executing: /bin/sh -c cd /var/lib/jenkins/workspace/Moving-Code-Runtime-RELEASE && git status
[INFO] Working directory: /var/lib/jenkins/workspace/Moving-Code-Runtime-RELEASE
[INFO] Checking dependencies and plugins for snapshots ...
[INFO] Transforming 'Moving Code Framework'...
[INFO] Updating mc-runtime to 1.1
[INFO] Ignoring artifact version update for expression: ${project.version}
[INFO] Updating mc-schema to 1.1
[INFO] Ignoring artifact version update for expression: ${project.version}
[INFO] Transforming 'Moving Code XML Schema'...
[INFO] Transforming 'Moving Code Runtime'...
[INFO] Updating mc-schema to 1.1
[INFO] Transforming 'Code Package Feed'...
[INFO] Updating mc-runtime to 1.1
[INFO] Not generating release POMs
[INFO] Executing goals 'clean verify'...
[INFO] Java HotSpot(TM) 64-Bit Server VM warning: ignoring option MaxPermSize=1024m; support was removed in 8.0
[INFO] [INFO] Scanning for projects...
[INFO] [INFO] ------------------------------------------------------------------------
[INFO] [INFO] Reactor Build Order:
[INFO] [INFO] 
[INFO] [INFO] Moving Code Framework
[INFO] [INFO] Moving Code XML Schema
[INFO] [INFO] Moving Code Runtime
[INFO] [INFO] Code Package Feed
[INFO] [INFO]                                                                         
[INFO] [INFO] ------------------------------------------------------------------------
[INFO] [INFO] Building Moving Code Framework 1.1
[INFO] [INFO] ------------------------------------------------------------------------
[INFO] [INFO] 
[INFO] [INFO] --- maven-clean-plugin:2.4.1:clean (default-clean) @ movingcode-parent ---
[INFO] [INFO]                                                                         
[INFO] [INFO] ------------------------------------------------------------------------
[INFO] [INFO] Building Moving Code XML Schema 1.1
[INFO] [INFO] ------------------------------------------------------------------------
[INFO] [INFO] 
[INFO] [INFO] --- maven-clean-plugin:2.4.1:clean (default-clean) @ mc-schema ---
[INFO] [INFO] Deleting /mnt/extra/jenkins/workspace/Moving-Code-Runtime-RELEASE/mc-schema/target
[INFO] [INFO] 
[INFO] [INFO] --- xmlbeans-maven-plugin:2.3.3:xmlbeans (default) @ mc-schema ---
[INFO] [INFO] 
[INFO] [INFO] --- maven-resources-plugin:2.5:resources (default-resources) @ mc-schema ---
[INFO] [debug] execute contextualize
[INFO] [INFO] Using 'UTF-8' encoding to copy filtered resources.
[INFO] [INFO] skip non existing resourceDirectory /mnt/extra/jenkins/workspace/Moving-Code-Runtime-RELEASE/mc-schema/src/main/resources
[INFO] [INFO] Copying 252 resources
[INFO] [INFO] 
[INFO] [INFO] --- maven-compiler-plugin:2.5.1:compile (default-compile) @ mc-schema ---
[INFO] [INFO] Nothing to compile - all classes are up to date
[INFO] [INFO] 
[INFO] [INFO] --- maven-resources-plugin:2.5:testResources (default-testResources) @ mc-schema ---
[INFO] [debug] execute contextualize
[INFO] [INFO] Using 'UTF-8' encoding to copy filtered resources.
[INFO] [INFO] skip non existing resourceDirectory /mnt/extra/jenkins/workspace/Moving-Code-Runtime-RELEASE/mc-schema/src/test/resources
[INFO] [INFO] 
[INFO] [INFO] --- maven-compiler-plugin:2.5.1:testCompile (default-testCompile) @ mc-schema ---
[INFO] [INFO] No sources to compile
[INFO] [INFO] 
[INFO] [INFO] --- maven-surefire-plugin:2.12.4:test (default-test) @ mc-schema ---
[INFO] [INFO] Tests are skipped.
[INFO] [INFO] 
[INFO] [INFO] --- maven-jar-plugin:2.4:jar (default-jar) @ mc-schema ---
[INFO] [INFO] Building jar: /mnt/extra/jenkins/workspace/Moving-Code-Runtime-RELEASE/mc-schema/target/mc-schema-1.1.jar
[INFO] [INFO]                                                                         
[INFO] [INFO] ------------------------------------------------------------------------
[INFO] [INFO] Building Moving Code Runtime 1.1
[INFO] [INFO] ------------------------------------------------------------------------
[INFO] [INFO] 
[INFO] [INFO] --- maven-clean-plugin:2.4.1:clean (default-clean) @ mc-runtime ---
[INFO] [INFO] Deleting /mnt/extra/jenkins/workspace/Moving-Code-Runtime-RELEASE/mc-runtime/target
[INFO] [INFO] 
[INFO] [INFO] --- license-maven-plugin:2.8:check (default) @ mc-runtime ---
[INFO] [INFO] Checking licenses...
[INFO] [INFO] 
[INFO] [INFO] --- maven-resources-plugin:2.5:resources (default-resources) @ mc-runtime ---
[INFO] [debug] execute contextualize
[INFO] [INFO] Using 'UTF-8' encoding to copy filtered resources.
[INFO] [INFO] Copying 6 resources
[INFO] [INFO] 
[INFO] [INFO] --- maven-compiler-plugin:2.5.1:compile (default-compile) @ mc-runtime ---
[INFO] [INFO] Compiling 53 source files to /mnt/extra/jenkins/workspace/Moving-Code-Runtime-RELEASE/mc-runtime/target/classes
[INFO] [INFO] 
[INFO] [INFO] --- maven-compiler-plugin:2.5.1:testCompile (test-compile) @ mc-runtime ---
[INFO] [INFO] Compiling 17 source files to /mnt/extra/jenkins/workspace/Moving-Code-Runtime-RELEASE/mc-runtime/target/test-classes
[INFO] [INFO] 
[INFO] [INFO] --- maven-resources-plugin:2.5:testResources (default-testResources) @ mc-runtime ---
[INFO] [debug] execute contextualize
[INFO] [INFO] Using 'UTF-8' encoding to copy filtered resources.
[INFO] [INFO] Copying 27 resources
[INFO] [INFO] 
[INFO] [INFO] --- maven-compiler-plugin:2.5.1:testCompile (default-testCompile) @ mc-runtime ---
[INFO] [INFO] Nothing to compile - all classes are up to date
[INFO] [INFO] 
[INFO] [INFO] --- maven-surefire-plugin:2.12.4:test (default-test) @ mc-runtime ---
[INFO] [INFO] Surefire report directory: /mnt/extra/jenkins/workspace/Moving-Code-Runtime-RELEASE/mc-runtime/target/surefire-reports
[INFO] 
[INFO] -------------------------------------------------------
[INFO]  T E S T S
[INFO] -------------------------------------------------------
[INFO] Running org.n52.movingcode.runtime.test.ValidatePackageTest
[INFO] 11:55:08.776 [main] INFO  o.n.m.r.test.MCRuntimeTestConfig - /mnt/extra/jenkins/workspace/Moving-Code-Runtime-RELEASE/mc-runtime/src/test/resources/testpackages/ztransform.zip
[INFO] Tests run: 2, Failures: 0, Errors: 0, Skipped: 0, Time elapsed: 0.353 sec
[INFO] Running org.n52.movingcode.runtime.test.FeedReadTest
[INFO] 11:55:09.065 [main] DEBUG o.n.m.r.c.AbstractRepository - Create RemoteFeedRepository from http://141.30.100.178/gpfeed2/gpfeed.xml
[INFO] 11:55:09.118 [main] DEBUG o.n.m.runtime.feed.CodePackageFeed - Loading Feed from sun.net.www.protocol.http.HttpURLConnection$HttpInputStream@657c8ad9
[INFO] 11:55:09.277 [main] INFO  o.n.m.runtime.feed.CodePackageFeed - New Feed: GeoprocessingAlgorithms
[INFO] 11:55:09.429 [main] DEBUG o.n.m.r.c.AbstractRepository - Loading package for feed entry de.tu-dresden.geo.gis.algorithms.test.ndvi
[INFO] 11:55:09.503 [main] DEBUG o.n.m.r.c.AbstractRepository - Loading package for feed entry de.tu-dresden.geo.gis.algorithms.raster.ztransform
[INFO] 11:55:09.571 [main] DEBUG o.n.m.r.c.AbstractRepository - Loading package for feed entry de.tu-dresden.geo.gis.algorithms.test.echo
[INFO] 11:55:09.638 [main] DEBUG o.n.m.r.c.AbstractRepository - Loading package for feed entry de.tu-dresden.geo.gis.algorithms.test.echo
[INFO] 11:55:09.652 [main] INFO  o.n.m.r.test.MCRuntimeTestConfig - Added Repo: http://141.30.100.178/gpfeed2/gpfeed.xml
[INFO] 11:55:09.673 [Timer-0] DEBUG o.n.m.runtime.feed.CodePackageFeed - Loading Feed from sun.net.www.protocol.http.HttpURLConnection$HttpInputStream@4dd97c40
[INFO] 11:55:09.674 [Timer-0] INFO  o.n.m.runtime.feed.CodePackageFeed - New Feed: GeoprocessingAlgorithms
[INFO] 11:55:09.674 [Timer-0] INFO  o.n.m.r.c.AbstractRepository - Reload finished.
[INFO] 11:55:09.685 [main] DEBUG o.n.m.r.processors.ProcessorFactory - Could not find a suitable processor for package: org.n52.movingcode.runtime.test.arctoolbox_ndvi_2014-07-08T09:00:00.000Z
[INFO] 11:55:09.686 [main] DEBUG o.n.m.r.processors.ProcessorFactory - Creating new processor for package: org.n52.movingcode.runtime.test.ztransform_2014-07-08T09:00:00.000Z
[INFO] 11:55:09.709 [main] DEBUG o.n.m.r.processors.ProcessorFactory - Creating new processor for package: org.n52.movingcode.runtime.test.jar_copy_2014-07-08T09:00:00.000Z
[INFO] 11:55:09.712 [main] INFO  o.n.m.r.test.MCRuntimeTestConfig - 
[INFO] 
[INFO] Found process: org.n52.movingcode.runtime.test.arctoolbox_ndvi_2014-07-08T09:00:00.000Z
[INFO] Couldn't get a processor for package org.n52.movingcode.runtime.test.arctoolbox_ndvi_2014-07-08T09:00:00.000Z
[INFO] 
[INFO] Found process: org.n52.movingcode.runtime.test.ztransform_2014-07-08T09:00:00.000Z
[INFO] Compatible Processors: org.n52.movingcode.runtime.processors.python.PythonCLIProcessor
[INFO] --- Parameters ---
[INFO] Parameter 1: 0..1
[INFO] ServiceOutputID: ZTRANSFORM
[INFO] Internal Type: MEDIA
[INFO] Parameter 2: 1..1
[INFO] ServiceInputID: REFERENCE_RASTER
[INFO] Internal Type: MEDIA
[INFO] Parameter 3: 2..1000
[INFO] ServiceInputID: STATS_RASTER
[INFO] Internal Type: MEDIA
[INFO] 
[INFO] Found process: org.n52.movingcode.runtime.test.jar_copy_2014-07-08T09:00:00.000Z
[INFO] Compatible Processors: org.n52.movingcode.runtime.processors.java.JavaJARProcessor
[INFO] --- Parameters ---
[INFO] Parameter 1: 1..1
[INFO] ServiceInputID: CALL
[INFO] Internal Type: MEDIA
[INFO] Parameter 2: 0..1
[INFO] ServiceOutputID: RESPONSE
[INFO] Internal Type: MEDIA
[INFO] 
[INFO] Tests run: 1, Failures: 0, Errors: 0, Skipped: 0, Time elapsed: 0.658 sec
[INFO] Running org.n52.movingcode.runtime.test.MovingCodeRepositoryTests
[INFO] 11:55:09.715 [main] INFO  o.n.m.r.test.MCRuntimeTestConfig - /mnt/extra/jenkins/workspace/Moving-Code-Runtime-RELEASE/mc-runtime/src/test/resources/testpackages
[INFO] 11:55:09.727 [main] INFO  o.n.m.r.c.AbstractRepository - Scanning directory: /mnt/extra/jenkins/workspace/Moving-Code-Runtime-RELEASE/mc-runtime/src/test/resources/testpackages
[INFO] 11:55:09.727 [main] DEBUG o.n.m.r.c.AbstractRepository - Found package: src/test/resources/testpackages/ztransform.zip
[INFO] 11:55:09.733 [main] DEBUG o.n.m.r.c.AbstractRepository - Registered package: src/test/resources/testpackages/ztransform.zip; using ID: org.n52.movingcode.runtime.test.ztransform_2014-07-08T09:00:00.000Z
[INFO] 11:55:09.733 [main] DEBUG o.n.m.r.c.AbstractRepository - Found package: src/test/resources/testpackages/py_copy.zip
[INFO] 11:55:09.738 [main] DEBUG o.n.m.r.c.AbstractRepository - Registered package: src/test/resources/testpackages/py_copy.zip; using ID: org.n52.movingcode.runtime.test.py_copy_2014-07-08T09:00:00.000Z
[INFO] 11:55:09.738 [main] DEBUG o.n.m.r.c.AbstractRepository - Found package: src/test/resources/testpackages/py_geca.zip
[INFO] 11:55:09.749 [main] DEBUG o.n.m.r.c.AbstractRepository - Registered package: src/test/resources/testpackages/py_geca.zip; using ID: org.n52.movingcode.runtime.test.py_geca_2014-07-08T09:00:00.000Z
[INFO] 11:55:09.749 [main] DEBUG o.n.m.r.c.AbstractRepository - Found package: src/test/resources/testpackages/arctoolbox_ndvi.zip
[INFO] 11:55:09.754 [main] DEBUG o.n.m.r.c.AbstractRepository - Registered package: src/test/resources/testpackages/arctoolbox_ndvi.zip; using ID: org.n52.movingcode.runtime.test.arctoolbox_ndvi_2014-07-08T09:00:00.000Z
[INFO] 11:55:09.754 [main] DEBUG o.n.m.r.c.AbstractRepository - Found package: src/test/resources/testpackages/jar_copy.zip
[INFO] 11:55:09.760 [main] DEBUG o.n.m.r.c.AbstractRepository - Registered package: src/test/resources/testpackages/jar_copy.zip; using ID: org.n52.movingcode.runtime.test.jar_copy_2014-07-08T09:00:00.000Z
[INFO] 11:55:09.760 [main] DEBUG o.n.m.r.test.MCRuntimeTestConfig - Retrieving process: de.tu-dresden.geo.gis.algorithms.raster.ztransform
[INFO] 11:55:09.764 [main] DEBUG o.n.m.r.test.MCRuntimeTestConfig - Found package: org.n52.movingcode.runtime.test.ztransform_2014-07-08T09:00:00.000Z supplying process de.tu-dresden.geo.gis.algorithms.raster.ztransform
[INFO] 11:55:09.765 [main] DEBUG o.n.m.r.processors.ProcessorFactory - Creating new processor for package: org.n52.movingcode.runtime.test.ztransform_2014-07-08T09:00:00.000Z
[INFO] 11:55:09.768 [main] INFO  o.n.m.r.test.MCRuntimeTestConfig - 
[INFO] --- Parameters ---
[INFO] Parameter 1: 0..1
[INFO] ServiceOutputID: ZTRANSFORM
[INFO] Internal Type: MEDIA
[INFO] Parameter 2: 1..1
[INFO] ServiceInputID: REFERENCE_RASTER
[INFO] Internal Type: MEDIA
[INFO] Parameter 3: 2..1000
[INFO] ServiceInputID: STATS_RASTER
[INFO] Internal Type: MEDIA
[INFO] 
[INFO] 11:55:09.769 [main] INFO  o.n.m.r.test.MCRuntimeTestConfig - Adding plain folder repo: /mnt/extra/jenkins/workspace/Moving-Code-Runtime-RELEASE/mc-runtime/src/test/resources/testpackages
[INFO] 11:55:09.776 [main] INFO  o.n.m.r.c.AbstractRepository - Scanning directory: /mnt/extra/jenkins/workspace/Moving-Code-Runtime-RELEASE/mc-runtime/src/test/resources/testpackages
[INFO] 11:55:09.781 [main] INFO  o.n.m.r.c.AbstractRepository - Found package: /mnt/extra/jenkins/workspace/Moving-Code-Runtime-RELEASE/mc-runtime/src/test/resources/testpackages/jar_copy; using ID: org.n52.movingcode.runtime.test.jar_copy_2014-07-08T09:00:00.000Z
[INFO] 11:55:09.784 [main] INFO  o.n.m.r.c.AbstractRepository - Found package: /mnt/extra/jenkins/workspace/Moving-Code-Runtime-RELEASE/mc-runtime/src/test/resources/testpackages/py_copy; using ID: org.n52.movingcode.runtime.test.py_copy_2014-07-08T09:00:00.000Z
[INFO] 11:55:09.788 [main] INFO  o.n.m.r.c.AbstractRepository - Found package: /mnt/extra/jenkins/workspace/Moving-Code-Runtime-RELEASE/mc-runtime/src/test/resources/testpackages/py_geca; using ID: org.n52.movingcode.runtime.test.py_geca_2014-07-08T09:00:00.000Z
[INFO] 11:55:09.792 [main] INFO  o.n.m.r.c.AbstractRepository - Found package: /mnt/extra/jenkins/workspace/Moving-Code-Runtime-RELEASE/mc-runtime/src/test/resources/testpackages/ztransform; using ID: org.n52.movingcode.runtime.test.ztransform_2014-07-08T09:00:00.000Z
[INFO] 11:55:09.795 [main] INFO  o.n.m.r.c.AbstractRepository - Found package: /mnt/extra/jenkins/workspace/Moving-Code-Runtime-RELEASE/mc-runtime/src/test/resources/testpackages/arctoolbox_ndvi; using ID: org.n52.movingcode.runtime.test.arctoolbox_ndvi_2014-07-08T09:00:00.000Z
[INFO] 11:55:09.796 [main] DEBUG o.n.m.r.processors.ProcessorFactory - Creating new processor for package: org.n52.movingcode.runtime.test.ztransform_2014-07-08T09:00:00.000Z
[INFO] 11:55:09.798 [main] INFO  o.n.m.r.test.MCRuntimeTestConfig - 
[INFO] Information for package: de.tu-dresden.geo.gis.algorithms.raster.ztransform
[INFO] Package Timestamp is: 2014-07-08T09:00:00.000Z
[INFO] --- Parameters ---
[INFO] Parameter 1: 0..1
[INFO] ServiceOutputID: ZTRANSFORM
[INFO] Internal Type: MEDIA
[INFO] Parameter 2: 1..1
[INFO] ServiceInputID: REFERENCE_RASTER
[INFO] Internal Type: MEDIA
[INFO] Parameter 3: 2..1000
[INFO] ServiceInputID: STATS_RASTER
[INFO] Internal Type: MEDIA
[INFO] 
[INFO] 11:55:09.799 [main] DEBUG o.n.m.r.c.AbstractRepository - Create RemoteFeedRepository from http://141.30.100.178/gpfeed2/gpfeed.xml
[INFO] 11:55:09.799 [Thread-3] DEBUG o.n.m.r.c.AbstractRepository - Update thread started.
[INFO] Directory: /mnt/extra/jenkins/workspace/Moving-Code-Runtime-RELEASE/mc-runtime/src/test/resources/testpackages
[INFO] Update interval: 20000 milliseconds
[INFO] 11:55:09.819 [main] DEBUG o.n.m.runtime.feed.CodePackageFeed - Loading Feed from sun.net.www.protocol.http.HttpURLConnection$HttpInputStream@28f3b248
[INFO] 11:55:09.821 [main] INFO  o.n.m.runtime.feed.CodePackageFeed - New Feed: GeoprocessingAlgorithms
[INFO] 11:55:09.890 [main] DEBUG o.n.m.r.c.AbstractRepository - Loading package for feed entry de.tu-dresden.geo.gis.algorithms.test.ndvi
[INFO] 11:55:09.958 [main] DEBUG o.n.m.r.c.AbstractRepository - Loading package for feed entry de.tu-dresden.geo.gis.algorithms.raster.ztransform
[INFO] 11:55:10.024 [main] DEBUG o.n.m.r.c.AbstractRepository - Loading package for feed entry de.tu-dresden.geo.gis.algorithms.test.echo
[INFO] 11:55:10.089 [main] DEBUG o.n.m.r.c.AbstractRepository - Loading package for feed entry de.tu-dresden.geo.gis.algorithms.test.echo
[INFO] 11:55:10.090 [main] INFO  o.n.m.r.test.MCRuntimeTestConfig - Added Repo: http://141.30.100.178/gpfeed2/gpfeed.xml
[INFO] 11:55:10.091 [main] DEBUG o.n.m.r.processors.ProcessorFactory - Could not find a suitable processor for package: org.n52.movingcode.runtime.test.arctoolbox_ndvi_2014-07-08T09:00:00.000Z
[INFO] 11:55:10.093 [main] DEBUG o.n.m.r.processors.ProcessorFactory - Creating new processor for package: org.n52.movingcode.runtime.test.ztransform_2014-07-08T09:00:00.000Z
[INFO] 11:55:10.099 [main] DEBUG o.n.m.r.processors.ProcessorFactory - Creating new processor for package: org.n52.movingcode.runtime.test.jar_copy_2014-07-08T09:00:00.000Z
[INFO] 11:55:10.101 [main] INFO  o.n.m.r.test.MCRuntimeTestConfig - 
[INFO] 
[INFO] Found process: org.n52.movingcode.runtime.test.arctoolbox_ndvi_2014-07-08T09:00:00.000Z
[INFO] Couldn't get a processor for package org.n52.movingcode.runtime.test.arctoolbox_ndvi_2014-07-08T09:00:00.000Z
[INFO] 
[INFO] Found process: org.n52.movingcode.runtime.test.ztransform_2014-07-08T09:00:00.000Z
[INFO] Compatible Processors: org.n52.movingcode.runtime.processors.python.PythonCLIProcessor
[INFO] --- Parameters ---
[INFO] Parameter 1: 0..1
[INFO] ServiceOutputID: ZTRANSFORM
[INFO] Internal Type: MEDIA
[INFO] Parameter 2: 1..1
[INFO] ServiceInputID: REFERENCE_RASTER
[INFO] Internal Type: MEDIA
[INFO] Parameter 3: 2..1000
[INFO] ServiceInputID: STATS_RASTER
[INFO] Internal Type: MEDIA
[INFO] 
[INFO] Found process: org.n52.movingcode.runtime.test.jar_copy_2014-07-08T09:00:00.000Z
[INFO] Compatible Processors: org.n52.movingcode.runtime.processors.java.JavaJARProcessor
[INFO] --- Parameters ---
[INFO] Parameter 1: 1..1
[INFO] ServiceInputID: CALL
[INFO] Internal Type: MEDIA
[INFO] Parameter 2: 0..1
[INFO] ServiceOutputID: RESPONSE
[INFO] Internal Type: MEDIA
[INFO] 
[INFO] 11:55:10.104 [main] INFO  o.n.m.r.c.AbstractRepository - Scanning directory: /tmp/x3n1mf84
[INFO] 11:55:10.106 [Thread-5] DEBUG o.n.m.r.c.AbstractRepository - Update thread started.
[INFO] Directory: /tmp/x3n1mf84
[INFO] Update interval: 20000 milliseconds
[INFO] 11:55:10.106 [main] INFO  o.n.m.r.test.MCRuntimeTestConfig - Added Repo: http://141.30.100.178/gpfeed2/gpfeed.xml
[INFO] 11:55:10.106 [main] INFO  o.n.m.r.test.MCRuntimeTestConfig - Using Cache directory: /tmp/x3n1mf84
[INFO] 11:55:10.106 [main] INFO  o.n.m.r.test.MCRuntimeTestConfig - 
[INFO] 
[INFO] 11:55:10.106 [main] INFO  o.n.m.r.test.MCRuntimeTestConfig - /mnt/extra/jenkins/workspace/Moving-Code-Runtime-RELEASE/mc-runtime/src/test/resources/testpackages
[INFO] 11:55:10.108 [main] INFO  o.n.m.r.c.AbstractRepository - Scanning directory: /mnt/extra/jenkins/workspace/Moving-Code-Runtime-RELEASE/mc-runtime/src/test/resources/testpackages
[INFO] 11:55:10.109 [main] INFO  o.n.m.r.c.AbstractRepository - Found package: /mnt/extra/jenkins/workspace/Moving-Code-Runtime-RELEASE/mc-runtime/src/test/resources/testpackages/jar_copy; using ID: org.n52.movingcode.runtime.test.jar_copy_2014-07-08T09:00:00.000Z
[INFO] 11:55:10.111 [main] INFO  o.n.m.r.c.AbstractRepository - Found package: /mnt/extra/jenkins/workspace/Moving-Code-Runtime-RELEASE/mc-runtime/src/test/resources/testpackages/py_copy; using ID: org.n52.movingcode.runtime.test.py_copy_2014-07-08T09:00:00.000Z
[INFO] 11:55:10.112 [Thread-6] INFO  o.n.m.r.c.CachedRemoteFeedRepository - Loading remote repository from URL http://141.30.100.178/gpfeed2/gpfeed.xml
[INFO] 11:55:10.112 [Thread-6] DEBUG o.n.m.r.c.AbstractRepository - Create RemoteFeedRepository from http://141.30.100.178/gpfeed2/gpfeed.xml
[INFO] 11:55:10.113 [Timer-2] DEBUG o.n.m.runtime.feed.CodePackageFeed - Loading Feed from sun.net.www.protocol.http.HttpURLConnection$HttpInputStream@159a106b
[INFO] 11:55:10.114 [main] INFO  o.n.m.r.c.AbstractRepository - Found package: /mnt/extra/jenkins/workspace/Moving-Code-Runtime-RELEASE/mc-runtime/src/test/resources/testpackages/py_geca; using ID: org.n52.movingcode.runtime.test.py_geca_2014-07-08T09:00:00.000Z
[INFO] 11:55:10.114 [Timer-2] INFO  o.n.m.runtime.feed.CodePackageFeed - New Feed: GeoprocessingAlgorithms
[INFO] 11:55:10.114 [Timer-2] INFO  o.n.m.r.c.AbstractRepository - Reload finished.
[INFO] 11:55:10.116 [main] INFO  o.n.m.r.c.AbstractRepository - Found package: /mnt/extra/jenkins/workspace/Moving-Code-Runtime-RELEASE/mc-runtime/src/test/resources/testpackages/ztransform; using ID: org.n52.movingcode.runtime.test.ztransform_2014-07-08T09:00:00.000Z
[INFO] 11:55:10.118 [main] INFO  o.n.m.r.c.AbstractRepository - Found package: /mnt/extra/jenkins/workspace/Moving-Code-Runtime-RELEASE/mc-runtime/src/test/resources/testpackages/arctoolbox_ndvi; using ID: org.n52.movingcode.runtime.test.arctoolbox_ndvi_2014-07-08T09:00:00.000Z
[INFO] 11:55:10.119 [main] INFO  o.n.m.r.test.MCRuntimeTestConfig - /tmp/z575f1g4/qggl8a79.zip
[INFO] 11:55:10.121 [Thread-7] DEBUG o.n.m.r.c.AbstractRepository - Update thread started.
[INFO] Directory: /mnt/extra/jenkins/workspace/Moving-Code-Runtime-RELEASE/mc-runtime/src/test/resources/testpackages
[INFO] Update interval: 20000 milliseconds
[INFO] Tests run: 6, Failures: 0, Errors: 0, Skipped: 0, Time elapsed: 0.417 sec
[INFO] Running org.n52.movingcode.runtime.test.MimetypesTest
[INFO] 11:55:10.132 [main] INFO  o.n.m.r.test.MCRuntimeTestConfig - File for application/netcdf is: nc
[INFO] Tests run: 1, Failures: 0, Errors: 0, Skipped: 0, Time elapsed: 0 sec
[INFO] Running org.n52.movingcode.runtime.test.ExecutableJARTest
[INFO] 11:55:10.133 [main] INFO  o.n.m.r.test.MCRuntimeTestConfig - /mnt/extra/jenkins/workspace/Moving-Code-Runtime-RELEASE/mc-runtime/target/test-classes:/mnt/extra/jenkins/workspace/Moving-Code-Runtime-RELEASE/mc-runtime/target/classes:/var/data/maven-repository/junit/junit/4.10/junit-4.10.jar:/var/data/maven-repository/org/hamcrest/hamcrest-core/1.1/hamcrest-core-1.1.jar:/var/data/maven-repository/ch/qos/logback/logback-classic/1.0.13/logback-classic-1.0.13.jar:/var/data/maven-repository/ch/qos/logback/logback-core/1.0.13/logback-core-1.0.13.jar:/var/data/maven-repository/org/slf4j/slf4j-api/1.7.5/slf4j-api-1.7.5.jar:/var/data/maven-repository/org/apache/xmlbeans/xmlbeans/2.4.0/xmlbeans-2.4.0.jar:/var/data/maven-repository/stax/stax-api/1.0.1/stax-api-1.0.1.jar:/var/data/maven-repository/commons-io/commons-io/2.4/commons-io-2.4.jar:/var/data/maven-repository/org/apache/commons/commons-exec/1.3/commons-exec-1.3.jar:/var/data/maven-repository/com/google/guava/guava-collections/r03/guava-collections-r03.jar:/var/data/maven-repository/com/google/guava/guava-annotations/r03/guava-annotations-r03.jar:/var/data/maven-repository/com/google/guava/guava-primitives/r03/guava-primitives-r03.jar:/var/data/maven-repository/com/google/guava/guava-base/r03/guava-base-r03.jar:/var/data/maven-repository/org/apache/commons/commons-lang3/3.3.2/commons-lang3-3.3.2.jar:/var/data/maven-repository/org/apache/abdera/abdera-bundle/1.1.2/abdera-bundle-1.1.2.jar:/var/data/maven-repository/commons-codec/commons-codec/1.4/commons-codec-1.4.jar:/var/data/maven-repository/org/apache/geronimo/specs/geronimo-activation_1.0.2_spec/1.1/geronimo-activation_1.0.2_spec-1.1.jar:/var/data/maven-repository/org/apache/geronimo/specs/geronimo-stax-api_1.0_spec/1.0.1/geronimo-stax-api_1.0_spec-1.0.1.jar:/var/data/maven-repository/commons-logging/commons-logging/1.0.4/commons-logging-1.0.4.jar:/var/data/maven-repository/org/apache/ws/commons/axiom/axiom-impl/1.2.10/axiom-impl-1.2.10.jar:/var/data/maven-repository/org/apache/ws/commons/axiom/axiom-api/1.2.10/axiom-api-1.2.10.jar:/var/data/maven-repository/org/apache/geronimo/specs/geronimo-activation_1.1_spec/1.0.2/geronimo-activation_1.1_spec-1.0.2.jar:/var/data/maven-repository/org/apache/geronimo/specs/geronimo-javamail_1.4_spec/1.6/geronimo-javamail_1.4_spec-1.6.jar:/var/data/maven-repository/jaxen/jaxen/1.1.1/jaxen-1.1.1.jar:/var/data/maven-repository/org/codehaus/woodstox/wstx-asl/3.2.6/wstx-asl-3.2.6.jar:/var/data/maven-repository/xml-apis/xml-apis/1.3.04/xml-apis-1.3.04.jar:/var/data/maven-repository/xerces/xercesImpl/2.9.1/xercesImpl-2.9.1.jar:/var/data/maven-repository/commons-httpclient/commons-httpclient/3.1/commons-httpclient-3.1.jar:/var/data/maven-repository/javax/servlet/servlet-api/2.5/servlet-api-2.5.jar:/var/data/maven-repository/javax/mail/mail/1.4/mail-1.4.jar:/var/data/maven-repository/javax/activation/activation/1.1/activation-1.1.jar:/var/data/maven-repository/org/springframework/spring-web/2.0.6/spring-web-2.0.6.jar:/var/data/maven-repository/org/springframework/spring-beans/2.0.6/spring-beans-2.0.6.jar:/var/data/maven-repository/org/springframework/spring-core/2.0.6/spring-core-2.0.6.jar:/var/data/maven-repository/org/springframework/spring-context/2.0.6/spring-context-2.0.6.jar:/var/data/maven-repository/aopalliance/aopalliance/1.0/aopalliance-1.0.jar:/var/data/maven-repository/org/apache/jackrabbit/jackrabbit-core/1.4/jackrabbit-core-1.4.jar:/var/data/maven-repository/concurrent/concurrent/1.3.4/concurrent-1.3.4.jar:/var/data/maven-repository/commons-collections/commons-collections/3.1/commons-collections-3.1.jar:/var/data/maven-repository/org/apache/jackrabbit/jackrabbit-api/1.4/jackrabbit-api-1.4.jar:/var/data/maven-repository/org/apache/jackrabbit/jackrabbit-jcr-commons/1.4/jackrabbit-jcr-commons-1.4.jar:/var/data/maven-repository/org/apache/jackrabbit/jackrabbit-spi-commons/1.4/jackrabbit-spi-commons-1.4.jar:/var/data/maven-repository/org/apache/jackrabbit/jackrabbit-spi/1.4/jackrabbit-spi-1.4.jar:/var/data/maven-repository/org/apache/jackrabbit/jackrabbit-text-extractors/1.4/jackrabbit-text-extractors-1.4.jar:/var/data/maven-repository/org/apache/lucene/lucene-core/2.2.0/lucene-core-2.2.0.jar:/var/data/maven-repository/org/apache/derby/derby/10.2.1.6/derby-10.2.1.6.jar:/var/data/maven-repository/javax/jcr/jcr/1.0/jcr-1.0.jar:/var/data/maven-repository/org/apache/ibatis/ibatis-sqlmap/2.3.0/ibatis-sqlmap-2.3.0.jar:/var/data/maven-repository/xml-security/xmlsec/1.3.0/xmlsec-1.3.0.jar:/var/data/maven-repository/bouncycastle/bcprov-jdk15/124/bcprov-jdk15-124.jar:/var/data/maven-repository/xalan/xalan/2.7.0/xalan-2.7.0.jar:/var/data/maven-repository/nu/validator/htmlparser/htmlparser/1.0.5/htmlparser-1.0.5.jar:/var/data/maven-repository/net/sf/json-lib/json-lib/2.2.2/json-lib-2.2.2-jdk15.jar:/var/data/maven-repository/commons-beanutils/commons-beanutils/1.7.0/commons-beanutils-1.7.0.jar:/var/data/maven-repository/commons-lang/commons-lang/2.4/commons-lang-2.4.jar:/var/data/maven-repository/net/sf/ezmorph/ezmorph/1.0.4/ezmorph-1.0.4.jar:/var/data/maven-repository/org/rosuda/REngine/0.6-8/REngine-0.6-8.jar:/var/data/maven-repository/org/rosuda/RserveEngine/0.6-8/RserveEngine-0.6-8.jar:/var/data/maven-repository/com/fasterxml/jackson/core/jackson-core/2.3.3/jackson-core-2.3.3.jar:/var/data/maven-repository/com/fasterxml/jackson/core/jackson-databind/2.3.3/jackson-databind-2.3.3.jar:/var/data/maven-repository/com/fasterxml/jackson/core/jackson-annotations/2.3.3/jackson-annotations-2.3.3.jar:/var/data/maven-repository/joda-time/joda-time/2.3/joda-time-2.3.jar:/mnt/extra/jenkins/workspace/Moving-Code-Runtime-RELEASE/mc-schema/target/mc-schema-1.1.jar:/var/data/maven-repository/org/n52/wps/52n-xml-wps-v100/1.1.0/52n-xml-wps-v100-1.1.0.jar:/var/data/maven-repository/org/n52/sensorweb/52n-xml-ows-v110/1.1.0/52n-xml-ows-v110-1.1.0.jar:/var/data/maven-repository/org/n52/sensorweb/52n-xml-xlink-v110/1.0.0/52n-xml-xlink-v110-1.0.0.jar:
[INFO] 11:55:10.140 [main] DEBUG o.n.m.r.processors.ProcessorFactory - Creating new processor for package: org.n52.movingcode.runtime.test.jar_copy_2014-07-08T09:00:00.000Z
[INFO] 11:55:10.144 [main] DEBUG o.n.m.r.processors.ProcessorFactory - Creating new processor for package: org.n52.movingcode.runtime.test.jar_copy_2014-07-08T09:00:00.000Z
[INFO] 11:55:10.152 [Thread-6] DEBUG o.n.m.runtime.feed.CodePackageFeed - Loading Feed from sun.net.www.protocol.http.HttpURLConnection$HttpInputStream@37cb7de7
[INFO] 11:55:10.153 [main] DEBUG o.n.m.r.processors.ProcessorFactory - Creating new processor for package: org.n52.movingcode.runtime.test.jar_copy_2014-07-08T09:00:00.000Z
[INFO] 11:55:10.156 [Thread-6] INFO  o.n.m.runtime.feed.CodePackageFeed - New Feed: GeoprocessingAlgorithms
[INFO] Tests run: 4, Failures: 0, Errors: 0, Skipped: 0, Time elapsed: 0.025 sec
[INFO] Running org.n52.movingcode.runtime.test.FeedConversionTest
[INFO] 11:55:10.164 [main] DEBUG o.n.m.r.c.AbstractRepository - Create RemoteFeedRepository from http://141.30.100.178/gpfeed2/gpfeed.xml
[INFO] 11:55:10.184 [main] DEBUG o.n.m.runtime.feed.CodePackageFeed - Loading Feed from sun.net.www.protocol.http.HttpURLConnection$HttpInputStream@2c35e847
[INFO] 11:55:10.185 [main] INFO  o.n.m.runtime.feed.CodePackageFeed - New Feed: GeoprocessingAlgorithms
[INFO] 11:55:10.234 [Thread-6] DEBUG o.n.m.r.c.AbstractRepository - Loading package for feed entry de.tu-dresden.geo.gis.algorithms.test.ndvi
[INFO] 11:55:10.296 [Thread-6] DEBUG o.n.m.r.c.AbstractRepository - Loading package for feed entry de.tu-dresden.geo.gis.algorithms.raster.ztransform
[INFO] 11:55:10.309 [main] DEBUG o.n.m.r.c.AbstractRepository - Loading package for feed entry de.tu-dresden.geo.gis.algorithms.test.ndvi
[INFO] 11:55:10.358 [Thread-6] DEBUG o.n.m.r.c.AbstractRepository - Loading package for feed entry de.tu-dresden.geo.gis.algorithms.test.echo
[INFO] 11:55:10.375 [main] DEBUG o.n.m.r.c.AbstractRepository - Loading package for feed entry de.tu-dresden.geo.gis.algorithms.raster.ztransform
[INFO] 11:55:10.421 [Thread-6] DEBUG o.n.m.r.c.AbstractRepository - Loading package for feed entry de.tu-dresden.geo.gis.algorithms.test.echo
[INFO] 11:55:10.422 [Thread-6] INFO  o.n.m.r.c.CachedRemoteFeedRepository - Finished loading remote repository from URL http://141.30.100.178/gpfeed2/gpfeed.xml
[INFO] 11:55:10.441 [Timer-3] DEBUG o.n.m.runtime.feed.CodePackageFeed - Loading Feed from sun.net.www.protocol.http.HttpURLConnection$HttpInputStream@258b37d9
[INFO] 11:55:10.442 [main] DEBUG o.n.m.r.c.AbstractRepository - Loading package for feed entry de.tu-dresden.geo.gis.algorithms.test.echo
[INFO] 11:55:10.443 [Timer-3] INFO  o.n.m.runtime.feed.CodePackageFeed - New Feed: GeoprocessingAlgorithms
[INFO] 11:55:10.444 [Timer-3] INFO  o.n.m.r.c.AbstractRepository - Reload finished.
[INFO] 11:55:10.508 [main] DEBUG o.n.m.r.c.AbstractRepository - Loading package for feed entry de.tu-dresden.geo.gis.algorithms.test.echo
[INFO] 11:55:10.508 [main] INFO  o.n.m.r.test.MCRuntimeTestConfig - Added Repo: http://141.30.100.178/gpfeed2/gpfeed.xml
[INFO] 11:55:10.509 [main] INFO  o.n.m.r.test.MCRuntimeTestConfig - Using temp dir /tmp/fenhe0e0
[INFO] Tests run: 1, Failures: 0, Errors: 0, Skipped: 0, Time elapsed: 0.346 sec
[INFO] Running org.n52.movingcode.runtime.test.IOParameterTest
[INFO] Tests run: 1, Failures: 0, Errors: 0, Skipped: 0, Time elapsed: 0 sec
[INFO] Running org.n52.movingcode.runtime.test.GeneralProcessorTest
[INFO] 11:55:10.510 [main] INFO  o.n.m.r.test.MCRuntimeTestConfig - 
[INFO] Processor found: org.n52.movingcode.runtime.processors.java.JavaJARProcessor
[INFO] Processor found: org.n52.movingcode.runtime.processors.python.PythonCLIProcessor
[INFO] 
[INFO] Tests run: 1, Failures: 0, Errors: 0, Skipped: 0, Time elapsed: 0.001 sec
[INFO] Running org.n52.movingcode.runtime.test.JSONConfigTest
[INFO] org.n52.movingcode.runtime.processors.java.JavaJARProcessor
[INFO] 	http://gis.geo.tu-dresden.de/movingcode/containerregistry/java-jar
[INFO] org.n52.movingcode.runtime.processors.python.PythonCLIProcessor
[INFO] 	http://gis.geo.tu-dresden.de/movingcode/containerregistry/pythonscript-2.5
[INFO] 
[INFO] Default Settings:
[INFO] C:/tmp
[INFO] 	http://gis.geo.tu-dresden.de/movingcode/platformregistry/component/gdal-1.8
[INFO] 	http://gis.geo.tu-dresden.de/movingcode/platformregistry/component/python-2.6
[INFO] 	http://gis.geo.tu-dresden.de/movingcode/platformregistry/component/python-2.7
[INFO] 	http://gis.geo.tu-dresden.de/movingcode/platformregistry/component/gdal-1.8-python-2.6
[INFO] 	http://gis.geo.tu-dresden.de/movingcode/platformregistry/component/arcgis-10.0
[INFO] 	http://gis.geo.tu-dresden.de/movingcode/platformregistry/component/arcgis-10.0-spatialanalyst
[INFO] 	http://gis.geo.tu-dresden.de/movingcode/platformregistry/platform/arcgis-10.0-analysis
[INFO] 	http://gis.geo.tu-dresden.de/movingcode/platformregistry/platform/java-1.6
[INFO] 	http://gis.geo.tu-dresden.de/movingcode/platformregistry/platform/java-1.7
[INFO] Tests run: 1, Failures: 0, Errors: 0, Skipped: 0, Time elapsed: 0 sec
[INFO] Running org.n52.movingcode.runtime.processors.AUIDTest
[INFO] 11:55:10.512 [main] INFO  o.n.m.r.test.MCRuntimeTestConfig - Genrating some AUIDs ...
[INFO] 11:55:10.516 [main] INFO  o.n.m.r.test.MCRuntimeTestConfig - 
[INFO] clb09l1n, l6ji8lhk, j0cdmg18, cpdcbm5l, e54oog3c, fn2gmja2, fecbagnh, s8ibjjnf, c0badgke, cg32aeea, 
[INFO] fok88edm, f3hf24oe, g1j7epml, ghd0nel1, bmold7ip, h47adcc2, he27cikl, bgj3f5bl, l1n8cnc4, ioam1flf, 
[INFO] y03i9n8c, zj1hi824, el2gga99, yppkj9b5, vfpdp9ga, qfo47okg, l9dbfnm3, gj6me8ng, icgp25ca, s5oaig29, 
[INFO] ud419icc, lkgd9jij, ond2p0ob, ioi999ib, t785g56e, r653nil4, y30m1ffl, dnchhap1, sfcail3j, hbpkamob, 
[INFO] u2gpk180, zba7j8gn, e61cpkbk, h2091dkb, yc9app8h, ondnmpcg, zdc677f3, ccknd164, tm0b6ih8, be4dg2m5, 
[INFO] m47pkkcj, k85oh94b, ok2cp16k, e8cip40j, lfo77p1m, kjflnjbj, smidje7k, p0dkl0i9, wl4l8ml7, r8hc05l7, 
[INFO] opji2469, ynpbj19l, a8c2laj4, q23ddn2o, u6mmp148, p5i8b7fi, ci3bamck, si6h9do7, n0amjh9p, udeceloo, 
[INFO] gom6np56, t9101ek4, jnig2h57, bg43gd1h, o8ebncmb, r80kmm1b, modobcm0, sah6mokm, j453k8c3, hjg1kgnn, 
[INFO] mf210d4c, mffn1o20, i6ccj5n6, e4lomk63, w07j50ma, iimlngd0, em8bokc4, bjn9jnp9, wc2ol4le, ogfdmg33, 
[INFO] tpp6734h, rd3lfl84, b4m7n47f, fd154bap, honko37h, jbk62bf9, nbdmha8l, ef4j4iih, xjh592d7, ro2bgnpa, 
[INFO] 
[INFO] Tests run: 1, Failures: 0, Errors: 0, Skipped: 0, Time elapsed: 0.005 sec
[INFO] 
[INFO] Results :
[INFO] 
[INFO] Tests run: 19, Failures: 0, Errors: 0, Skipped: 0
[INFO] 
[INFO] [INFO] 
[INFO] [INFO] --- maven-jar-plugin:2.4:jar (default-jar) @ mc-runtime ---
[INFO] [INFO] Building jar: /mnt/extra/jenkins/workspace/Moving-Code-Runtime-RELEASE/mc-runtime/target/mc-runtime-1.1.jar
[INFO] [INFO]                                                                         
[INFO] [INFO] ------------------------------------------------------------------------
[INFO] [INFO] Building Code Package Feed 1.1
[INFO] [INFO] ------------------------------------------------------------------------
[INFO] [INFO] 
[INFO] [INFO] --- maven-clean-plugin:2.4.1:clean (default-clean) @ mc-feed ---
[INFO] [INFO] Deleting /mnt/extra/jenkins/workspace/Moving-Code-Runtime-RELEASE/mc-feed/target
[INFO] [INFO] 
[INFO] [INFO] --- license-maven-plugin:2.8:check (default) @ mc-feed ---
[INFO] [INFO] Checking licenses...
[INFO] [INFO] 
[INFO] [INFO] --- maven-resources-plugin:2.5:resources (default-resources) @ mc-feed ---
[INFO] [debug] execute contextualize
[INFO] [INFO] Using 'UTF-8' encoding to copy filtered resources.
[INFO] [INFO] Copying 1 resource
[INFO] [INFO] 
[INFO] [INFO] --- maven-compiler-plugin:2.5.1:compile (default-compile) @ mc-feed ---
[INFO] [INFO] Compiling 5 source files to /mnt/extra/jenkins/workspace/Moving-Code-Runtime-RELEASE/mc-feed/target/classes
[INFO] [INFO] 
[INFO] [INFO] --- maven-compiler-plugin:2.5.1:testCompile (test-compile) @ mc-feed ---
[INFO] [INFO] No sources to compile
[INFO] [INFO] 
[INFO] [INFO] --- maven-resources-plugin:2.5:testResources (default-testResources) @ mc-feed ---
[INFO] [debug] execute contextualize
[INFO] [INFO] Using 'UTF-8' encoding to copy filtered resources.
[INFO] [INFO] skip non existing resourceDirectory /mnt/extra/jenkins/workspace/Moving-Code-Runtime-RELEASE/mc-feed/src/test/resources
[INFO] [INFO] 
[INFO] [INFO] --- maven-compiler-plugin:2.5.1:testCompile (default-testCompile) @ mc-feed ---
[INFO] [INFO] No sources to compile
[INFO] [INFO] 
[INFO] [INFO] --- maven-surefire-plugin:2.12.4:test (default-test) @ mc-feed ---
[INFO] [INFO] Tests are skipped.
[INFO] [INFO] 
[INFO] [INFO] --- maven-war-plugin:2.4:war (default-war) @ mc-feed ---
[INFO] [INFO] Packaging webapp
[INFO] [INFO] Assembling webapp [mc-feed] in [/mnt/extra/jenkins/workspace/Moving-Code-Runtime-RELEASE/mc-feed/target/mc-feed]
[INFO] [INFO] Processing war project
[INFO] [INFO] Webapp assembled in [72 msecs]
[INFO] [INFO] Building war: /mnt/extra/jenkins/workspace/Moving-Code-Runtime-RELEASE/mc-feed/target/mc-feed.war
[INFO] [INFO] ------------------------------------------------------------------------
[INFO] [INFO] Reactor Summary:
[INFO] [INFO] 
[INFO] [INFO] Moving Code Framework ............................. SUCCESS [0.064s]
[INFO] [INFO] Moving Code XML Schema ............................ SUCCESS [3.097s]
[INFO] [INFO] Moving Code Runtime ............................... SUCCESS [4.390s]
[INFO] [INFO] Code Package Feed ................................. SUCCESS [1.237s]
[INFO] [INFO] ------------------------------------------------------------------------
[INFO] [INFO] BUILD SUCCESS
[INFO] [INFO] ------------------------------------------------------------------------
[INFO] [INFO] Total time: 9.190s
[INFO] [INFO] Finished at: Mon May 02 11:55:12 UTC 2016
[INFO] [INFO] Final Memory: 31M/324M
[INFO] [INFO] ------------------------------------------------------------------------
[INFO] Checking in modified POMs...
[INFO] Executing: /bin/sh -c cd /var/lib/jenkins/workspace/Moving-Code-Runtime-RELEASE && git add -- pom.xml mc-schema/pom.xml mc-runtime/pom.xml mc-feed/pom.xml
[INFO] Working directory: /var/lib/jenkins/workspace/Moving-Code-Runtime-RELEASE
[INFO] Executing: /bin/sh -c cd /var/lib/jenkins/workspace/Moving-Code-Runtime-RELEASE && git status
[INFO] Working directory: /var/lib/jenkins/workspace/Moving-Code-Runtime-RELEASE
[INFO] Executing: /bin/sh -c cd /var/lib/jenkins/workspace/Moving-Code-Runtime-RELEASE && git commit --verbose -F /tmp/maven-scm-495157267.commit pom.xml mc-schema/pom.xml mc-runtime/pom.xml mc-feed/pom.xml
[INFO] Working directory: /var/lib/jenkins/workspace/Moving-Code-Runtime-RELEASE
[INFO] Executing: /bin/sh -c cd /var/lib/jenkins/workspace/Moving-Code-Runtime-RELEASE && git symbolic-ref HEAD
[INFO] Working directory: /var/lib/jenkins/workspace/Moving-Code-Runtime-RELEASE
[INFO] ------------------------------------------------------------------------
[INFO] Reactor Summary:
[INFO] 
[INFO] Moving Code Framework ............................. FAILURE [11.227s]
[INFO] Moving Code XML Schema ............................ SKIPPED
[INFO] Moving Code Runtime ............................... SKIPPED
[INFO] Code Package Feed ................................. SKIPPED
[INFO] ------------------------------------------------------------------------
[INFO] BUILD FAILURE
[INFO] ------------------------------------------------------------------------
[INFO] Total time: 11.895s
[INFO] Finished at: Mon May 02 11:55:12 UTC 2016
[INFO] Final Memory: 12M/156M
[INFO] ------------------------------------------------------------------------
Waiting for Jenkins to finish collecting data[ERROR] Failed to execute goal org.apache.maven.plugins:maven-release-plugin:2.1:prepare (default-cli) on project movingcode-parent: An error is occurred in the checkin process: Exception while executing SCM command. Detecting the current branch failed: fatal: ref HEAD is not a symbolic ref -> [Help 1]
[ERROR] 
[ERROR] To see the full stack trace of the errors, re-run Maven with the -e switch.
[ERROR] Re-run Maven using the -X switch to enable full debug logging.
[ERROR] 
[ERROR] For more information about the errors and possible solutions, please read the following articles:
[ERROR] [Help 1] http://cwiki.apache.org/confluence/display/MAVEN/MojoExecutionException

[JENKINS] Archiving /var/lib/jenkins/workspace/Moving-Code-Runtime-RELEASE/mc-feed/pom.xml to org.n52.mc/mc-feed/1.1-SNAPSHOT/mc-feed-1.1-SNAPSHOT.pom
[JENKINS] Archiving /var/lib/jenkins/workspace/Moving-Code-Runtime-RELEASE/mc-schema/pom.xml to org.n52.mc/mc-schema/1.1-SNAPSHOT/mc-schema-1.1-SNAPSHOT.pom
[JENKINS] Archiving /var/lib/jenkins/workspace/Moving-Code-Runtime-RELEASE/mc-runtime/pom.xml to org.n52.mc/mc-runtime/1.1-SNAPSHOT/mc-runtime-1.1-SNAPSHOT.pom
[JENKINS] Archiving /var/lib/jenkins/workspace/Moving-Code-Runtime-RELEASE/pom.xml to org.n52.mc/movingcode-parent/1.1-SNAPSHOT/movingcode-parent-1.1-SNAPSHOT.pom
Sending e-mails to: geoprocessing-commits@52north.org
channel stopped
Sending e-mails to: geoprocessing-commits@52north.org
Finished: FAILURE