Console Output

Started by user BenjaminPross
Building in workspace /var/lib/jenkins/workspace/Moving-Code-Runtime-RELEASE
Cleaning up /var/lib/jenkins/workspace/Moving-Code-Runtime-RELEASE/.
Deleting /var/lib/jenkins/workspace/Moving-Code-Runtime-RELEASE/mc-runtime/target
Deleting /var/lib/jenkins/workspace/Moving-Code-Runtime-RELEASE/mc-xml-processors/target
Updating https://svn.52north.org/svn/geoprocessing/main/movingcode/movingcode-runtime/trunk at revision '2013-07-15T14:52:14.969 +0200'
At revision 3286
no change for https://svn.52north.org/svn/geoprocessing/main/movingcode/movingcode-runtime/trunk since the previous build
Parsing POMs
[Moving-Code-Runtime-RELEASE] $ java -Xmx1024m -XX:MaxPermSize=1024m -cp /var/lib/jenkins/plugins/maven-plugin/WEB-INF/lib/maven3-agent-1.2.jar:/var/lib/jenkins/tools/hudson.tasks.Maven_MavenInstallation/Maven_3.0.x/boot/plexus-classworlds-2.4.jar org.jvnet.hudson.maven3.agent.Maven3Main /var/lib/jenkins/tools/hudson.tasks.Maven_MavenInstallation/Maven_3.0.x /var/cache/jenkins/war/WEB-INF/lib/remoting-2.23.jar /var/lib/jenkins/plugins/maven-plugin/WEB-INF/lib/maven3-interceptor-1.2.jar 51959
<===[JENKINS REMOTING CAPACITY]===>channel started
log4j:WARN No appenders could be found for logger (org.apache.commons.beanutils.converters.BooleanConverter).
log4j:WARN Please initialize the log4j system properly.
Executing Maven:  -B -f /var/lib/jenkins/workspace/Moving-Code-Runtime-RELEASE/pom.xml -DdevelopmentVersion=0.7-SNAPSHOT -DreleaseVersion=0.6 -Dresume=false release:prepare release:perform -Denv=release
[INFO] Scanning for projects...
[INFO] ------------------------------------------------------------------------
[INFO] Reactor Build Order:
[INFO] 
[INFO] Moving Code Runtime Reactor
[INFO] mc-xml-processors
[INFO] 52North Moving Code Runtime
[INFO]                                                                         
[INFO] ------------------------------------------------------------------------
[INFO] Building Moving Code Runtime Reactor 0.6-SNAPSHOT
[INFO] ------------------------------------------------------------------------
[INFO] 
[INFO] --- maven-release-plugin:2.1:prepare (default-cli) @ movingcode-runtime-parent ---
[INFO] Verifying that there are no local modifications...
[INFO]   ignoring changes on: pom.xml.next, release.properties, pom.xml.releaseBackup, pom.xml.backup, pom.xml.branch, pom.xml.tag
[INFO] Executing: /bin/sh -c cd /var/lib/jenkins/workspace/Moving-Code-Runtime-RELEASE && svn --non-interactive status
[INFO] Working directory: /var/lib/jenkins/workspace/Moving-Code-Runtime-RELEASE
[INFO] Checking dependencies and plugins for snapshots ...
[INFO] Transforming 'Moving Code Runtime Reactor'...
[INFO] Updating mc-runtime to 0.6
[INFO] Ignoring artifact version update for expression: ${project.version}
[INFO] Updating mc-xml-processors to 0.6
[INFO] Ignoring artifact version update for expression: ${project.version}
[INFO] Transforming 'mc-xml-processors'...
[INFO] Transforming '52North Moving Code Runtime'...
[INFO] Updating mc-xml-processors to 0.6
[INFO] Not generating release POMs
[INFO] Executing goals 'clean verify'...
[INFO] [INFO] Scanning for projects...
[INFO] [INFO] ------------------------------------------------------------------------
[INFO] [INFO] Reactor Build Order:
[INFO] [INFO] 
[INFO] [INFO] Moving Code Runtime Reactor
[INFO] [INFO] mc-xml-processors
[INFO] [INFO] 52North Moving Code Runtime
[INFO] [INFO]                                                                         
[INFO] [INFO] ------------------------------------------------------------------------
[INFO] [INFO] Building Moving Code Runtime Reactor 0.6
[INFO] [INFO] ------------------------------------------------------------------------
[INFO] [INFO] 
[INFO] [INFO] --- maven-clean-plugin:2.4.1:clean (default-clean) @ movingcode-runtime-parent ---
[INFO] [INFO]                                                                         
[INFO] [INFO] ------------------------------------------------------------------------
[INFO] [INFO] Building mc-xml-processors 0.6
[INFO] [INFO] ------------------------------------------------------------------------
[INFO] [INFO] 
[INFO] [INFO] --- maven-clean-plugin:2.4.1:clean (default-clean) @ mc-xml-processors ---
[INFO] [INFO] 
[INFO] [INFO] --- xmlbeans-maven-plugin:2.3.3:xmlbeans (sources) @ mc-xml-processors ---
[INFO] [INFO] 
[INFO] [INFO] --- maven-resources-plugin:2.5:resources (default-resources) @ mc-xml-processors ---
[INFO] [debug] execute contextualize
[INFO] [INFO] Using 'UTF-8' encoding to copy filtered resources.
[INFO] [INFO] skip non existing resourceDirectory /var/lib/jenkins/workspace/Moving-Code-Runtime-RELEASE/mc-xml-processors/src/main/resources
[INFO] [INFO] Copying 61 resources
[INFO] [INFO] 
[INFO] [INFO] --- maven-compiler-plugin:2.5.1:compile (default-compile) @ mc-xml-processors ---
[INFO] [INFO] Nothing to compile - all classes are up to date
[INFO] [INFO] 
[INFO] [INFO] --- maven-resources-plugin:2.5:testResources (default-testResources) @ mc-xml-processors ---
[INFO] [debug] execute contextualize
[INFO] [INFO] Using 'UTF-8' encoding to copy filtered resources.
[INFO] [INFO] skip non existing resourceDirectory /var/lib/jenkins/workspace/Moving-Code-Runtime-RELEASE/mc-xml-processors/src/test/resources
[INFO] [INFO] 
[INFO] [INFO] --- maven-compiler-plugin:2.5.1:testCompile (default-testCompile) @ mc-xml-processors ---
[INFO] [INFO] No sources to compile
[INFO] [INFO] 
[INFO] [INFO] --- maven-surefire-plugin:2.12.4:test (default-test) @ mc-xml-processors ---
[INFO] [INFO] Tests are skipped.
[INFO] [INFO] 
[INFO] [INFO] --- maven-jar-plugin:2.4:jar (default-jar) @ mc-xml-processors ---
[INFO] [INFO] Building jar: /var/lib/jenkins/workspace/Moving-Code-Runtime-RELEASE/mc-xml-processors/target/mc-xml-processors-0.6.jar
[INFO] [INFO]                                                                         
[INFO] [INFO] ------------------------------------------------------------------------
[INFO] [INFO] Building 52North Moving Code Runtime 0.6
[INFO] [INFO] ------------------------------------------------------------------------
[INFO] [INFO] 
[INFO] [INFO] --- maven-clean-plugin:2.4.1:clean (default-clean) @ mc-runtime ---
[INFO] [INFO] 
[INFO] [INFO] --- maven-resources-plugin:2.5:resources (default-resources) @ mc-runtime ---
[INFO] [debug] execute contextualize
[INFO] [INFO] Using 'UTF-8' encoding to copy filtered resources.
[INFO] [INFO] Copying 7 resources
[INFO] [INFO] 
[INFO] [INFO] --- maven-compiler-plugin:2.5.1:compile (default-compile) @ mc-runtime ---
[INFO] [INFO] Compiling 48 source files to /var/lib/jenkins/workspace/Moving-Code-Runtime-RELEASE/mc-runtime/target/classes
[INFO] [INFO] 
[INFO] [INFO] --- maven-compiler-plugin:2.5.1:testCompile (test-compile) @ mc-runtime ---
[INFO] [INFO] Compiling 17 source files to /var/lib/jenkins/workspace/Moving-Code-Runtime-RELEASE/mc-runtime/target/test-classes
[INFO] [INFO] 
[INFO] [INFO] --- maven-resources-plugin:2.5:testResources (default-testResources) @ mc-runtime ---
[INFO] [debug] execute contextualize
[INFO] [INFO] Using 'UTF-8' encoding to copy filtered resources.
[INFO] [INFO] Copying 28 resources
[INFO] [INFO] 
[INFO] [INFO] --- maven-compiler-plugin:2.5.1:testCompile (default-testCompile) @ mc-runtime ---
[INFO] [INFO] Nothing to compile - all classes are up to date
[INFO] [INFO] 
[INFO] [INFO] --- maven-surefire-plugin:2.12.4:test (default-test) @ mc-runtime ---
[INFO] [INFO] Surefire report directory: /var/lib/jenkins/workspace/Moving-Code-Runtime-RELEASE/mc-runtime/target/surefire-reports
[INFO] 
[INFO] -------------------------------------------------------
[INFO]  T E S T S
[INFO] -------------------------------------------------------
[INFO] Running org.n52.movingcode.runtime.test.ExecutableJARTest
[INFO] 2013-07-15 14:52:27,450 [main] INFO  org.n52.movingcode.runtime.test.MCRuntimeTestConfig - /var/lib/jenkins/workspace/Moving-Code-Runtime-RELEASE/mc-runtime/target/test-classes:/var/lib/jenkins/workspace/Moving-Code-Runtime-RELEASE/mc-runtime/target/classes:/var/data/maven-repository/junit/junit/4.10/junit-4.10.jar:/var/data/maven-repository/org/hamcrest/hamcrest-core/1.1/hamcrest-core-1.1.jar:/var/lib/jenkins/workspace/Moving-Code-Runtime-RELEASE/mc-xml-processors/target/mc-xml-processors-0.6.jar:/var/data/maven-repository/org/apache/xmlbeans/xmlbeans/2.4.0/xmlbeans-2.4.0.jar:/var/data/maven-repository/stax/stax-api/1.0.1/stax-api-1.0.1.jar:/var/data/maven-repository/commons-lang/commons-lang/2.5/commons-lang-2.5.jar:/var/data/maven-repository/commons-io/commons-io/2.0/commons-io-2.0.jar:/var/data/maven-repository/org/apache/commons/commons-exec/1.1/commons-exec-1.1.jar:/var/data/maven-repository/com/google/guava/guava-collections/r03/guava-collections-r03.jar:/var/data/maven-repository/com/google/guava/guava-annotations/r03/guava-annotations-r03.jar:/var/data/maven-repository/com/google/guava/guava-primitives/r03/guava-primitives-r03.jar:/var/data/maven-repository/com/google/guava/guava-base/r03/guava-base-r03.jar:/var/data/maven-repository/log4j/log4j/1.2.16/log4j-1.2.16.jar:/var/data/maven-repository/commons-logging/commons-logging/1.0.4/commons-logging-1.0.4.jar:/var/data/maven-repository/org/apache/abdera/abdera-bundle/1.1.2/abdera-bundle-1.1.2.jar:/var/data/maven-repository/commons-codec/commons-codec/1.4/commons-codec-1.4.jar:/var/data/maven-repository/org/apache/geronimo/specs/geronimo-activation_1.0.2_spec/1.1/geronimo-activation_1.0.2_spec-1.1.jar:/var/data/maven-repository/org/apache/geronimo/specs/geronimo-stax-api_1.0_spec/1.0.1/geronimo-stax-api_1.0_spec-1.0.1.jar:/var/data/maven-repository/org/apache/ws/commons/axiom/axiom-impl/1.2.10/axiom-impl-1.2.10.jar:/var/data/maven-repository/org/apache/ws/commons/axiom/axiom-api/1.2.10/axiom-api-1.2.10.jar:/var/data/maven-repository/org/apache/geronimo/specs/geronimo-activation_1.1_spec/1.0.2/geronimo-activation_1.1_spec-1.0.2.jar:/var/data/maven-repository/org/apache/geronimo/specs/geronimo-javamail_1.4_spec/1.6/geronimo-javamail_1.4_spec-1.6.jar:/var/data/maven-repository/jaxen/jaxen/1.1.1/jaxen-1.1.1.jar:/var/data/maven-repository/org/codehaus/woodstox/wstx-asl/3.2.6/wstx-asl-3.2.6.jar:/var/data/maven-repository/xml-apis/xml-apis/1.3.04/xml-apis-1.3.04.jar:/var/data/maven-repository/xerces/xercesImpl/2.9.1/xercesImpl-2.9.1.jar:/var/data/maven-repository/commons-httpclient/commons-httpclient/3.1/commons-httpclient-3.1.jar:/var/data/maven-repository/javax/servlet/servlet-api/2.5/servlet-api-2.5.jar:/var/data/maven-repository/javax/mail/mail/1.4/mail-1.4.jar:/var/data/maven-repository/javax/activation/activation/1.1/activation-1.1.jar:/var/data/maven-repository/org/springframework/spring-web/2.0.6/spring-web-2.0.6.jar:/var/data/maven-repository/org/springframework/spring-beans/2.0.6/spring-beans-2.0.6.jar:/var/data/maven-repository/org/springframework/spring-core/2.0.6/spring-core-2.0.6.jar:/var/data/maven-repository/org/springframework/spring-context/2.0.6/spring-context-2.0.6.jar:/var/data/maven-repository/aopalliance/aopalliance/1.0/aopalliance-1.0.jar:/var/data/maven-repository/org/apache/jackrabbit/jackrabbit-core/1.4/jackrabbit-core-1.4.jar:/var/data/maven-repository/concurrent/concurrent/1.3.4/concurrent-1.3.4.jar:/var/data/maven-repository/commons-collections/commons-collections/3.1/commons-collections-3.1.jar:/var/data/maven-repository/org/apache/jackrabbit/jackrabbit-api/1.4/jackrabbit-api-1.4.jar:/var/data/maven-repository/org/apache/jackrabbit/jackrabbit-jcr-commons/1.4/jackrabbit-jcr-commons-1.4.jar:/var/data/maven-repository/org/slf4j/slf4j-api/1.3.0/slf4j-api-1.3.0.jar:/var/data/maven-repository/org/apache/jackrabbit/jackrabbit-spi-commons/1.4/jackrabbit-spi-commons-1.4.jar:/var/data/maven-repository/org/apache/jackrabbit/jackrabbit-spi/1.4/jackrabbit-spi-1.4.jar:/var/data/maven-repository/org/apache/jackrabbit/jackrabbit-text-extractors/1.4/jackrabbit-text-extractors-1.4.jar:/var/data/maven-repository/org/apache/lucene/lucene-core/2.2.0/lucene-core-2.2.0.jar:/var/data/maven-repository/org/apache/derby/derby/10.2.1.6/derby-10.2.1.6.jar:/var/data/maven-repository/javax/jcr/jcr/1.0/jcr-1.0.jar:/var/data/maven-repository/org/apache/ibatis/ibatis-sqlmap/2.3.0/ibatis-sqlmap-2.3.0.jar:/var/data/maven-repository/xml-security/xmlsec/1.3.0/xmlsec-1.3.0.jar:/var/data/maven-repository/bouncycastle/bcprov-jdk15/124/bcprov-jdk15-124.jar:/var/data/maven-repository/xalan/xalan/2.7.0/xalan-2.7.0.jar:/var/data/maven-repository/nu/validator/htmlparser/htmlparser/1.0.5/htmlparser-1.0.5.jar:/var/data/maven-repository/net/sf/json-lib/json-lib/2.2.2/json-lib-2.2.2-jdk15.jar:/var/data/maven-repository/commons-beanutils/commons-beanutils/1.7.0/commons-beanutils-1.7.0.jar:/var/data/maven-repository/net/sf/ezmorph/ezmorph/1.0.4/ezmorph-1.0.4.jar:/var/data/maven-repository/org/rosuda/REngine/0.6-8/REngine-0.6-8.jar:/var/data/maven-repository/org/rosuda/RserveEngine/0.6-8/RserveEngine-0.6-8.jar:/var/data/maven-repository/org/n52/mc/mc-schema/1.0/mc-schema-1.0.jar:
[INFO] Tests run: 4, Failures: 0, Errors: 0, Skipped: 0, Time elapsed: 0.359 sec
[INFO] Running org.n52.movingcode.runtime.test.RepoUtilsTest
[INFO] Tests run: 1, Failures: 0, Errors: 0, Skipped: 0, Time elapsed: 0 sec
[INFO] Running org.n52.movingcode.runtime.test.MimetypesTest
[INFO] 2013-07-15 14:52:27,603 [main] INFO  org.n52.movingcode.runtime.test.MCRuntimeTestConfig - File for application/netcdf is: nc
[INFO] Tests run: 1, Failures: 0, Errors: 0, Skipped: 0, Time elapsed: 0 sec
[INFO] Running org.n52.movingcode.runtime.test.ValidatePackageTest
[INFO] 2013-07-15 14:52:27,604 [main] INFO  org.n52.movingcode.runtime.test.MCRuntimeTestConfig - /var/lib/jenkins/workspace/Moving-Code-Runtime-RELEASE/mc-runtime/src/test/resources/testpackages/ztransform.zip
[INFO] Tests run: 3, Failures: 0, Errors: 0, Skipped: 0, Time elapsed: 0.006 sec
[INFO] Running org.n52.movingcode.runtime.test.AUIDTest
[INFO] 2013-07-15 14:52:27,622 [main] INFO  org.n52.movingcode.runtime.test.MCRuntimeTestConfig - Genrating some AUIDs ...
[INFO] 2013-07-15 14:52:27,626 [main] INFO  org.n52.movingcode.runtime.test.MCRuntimeTestConfig - 
[INFO] wefddai7, fbjd99pc, fg5h4eah, tacl3g0l, jlnf5k61, lk3an771, yimfi9eb, i78kdcpa, ae11f4mp, eg0hopb4, 
[INFO] mkh37lak, rmch3gcd, unod5ffk, ykie8ilj, cg55b044, np5geo5a, tb361dhn, v7je209a, dl140kno, opgo79k8, 
[INFO] a6phlc6f, n0k6h3gj, n7pkm7g9, n0mch041, fo6168f8, km1gdpmc, s54pi9cj, qiijb576, db419f93, bjhb0dc0, 
[INFO] lcifk74n, t987n5o6, af5oid0a, tljnlf9b, x5m4lk7k, achaan06, mdn8fc87, zd849phi, xbekg3bl, if99m50d, 
[INFO] z0pp7od8, kcab2gid, zgmnh95h, wcm4jicl, u4on3jfc, cbo7762n, fdocefp6, aj7p6h4o, xb48hmmk, t0gp726j, 
[INFO] ohe415ed, pf660cj6, gnnpp786, mdhl7pdi, uce0d09d, u2m33pl1, tod6kma2, do15hpk4, wklggd3p, he34kiio, 
[INFO] ogj4bi97, h0b8odbc, zpo7fljm, ylkpd9ek, ki3ki0f2, km9ekjn6, ebi7hml8, yhok6g07, lmjjggob, v9gable5, 
[INFO] n221mglk, zaobng55, mmobe9c0, d0oidm0b, ka6jejpl, h2cejnen, zmj0kdm4, tle5e410, f5pd44mj, apco312m, 
[INFO] o6972icm, mhck3del, jgjii2e0, mggc9o7j, w3jml16b, o7h14m8f, d0pph5gh, z4phkkdk, pjp5j63p, i24be4i5, 
[INFO] c8eihl48, x27jc252, xhfeh1cf, lfca6bo1, fafodnn4, eg66h3of, l11hc961, xcm63h4a, a2cb5n87, s2choi5i, 
[INFO] 
[INFO] Tests run: 1, Failures: 0, Errors: 0, Skipped: 0, Time elapsed: 0.009 sec
[INFO] Running org.n52.movingcode.runtime.test.IOParameterTest
[INFO] Tests run: 1, Failures: 0, Errors: 0, Skipped: 0, Time elapsed: 0 sec
[INFO] Running org.n52.movingcode.runtime.test.MovingCodeRepositoryTests
[INFO] 2013-07-15 14:52:27,629 [main] INFO  org.n52.movingcode.runtime.test.MCRuntimeTestConfig - /var/lib/jenkins/workspace/Moving-Code-Runtime-RELEASE/mc-runtime/src/test/resources/testpackages
[INFO] 2013-07-15 14:52:27,654 [main] INFO  org.n52.movingcode.runtime.coderepository.AbstractRepository - Scanning directory: /var/lib/jenkins/workspace/Moving-Code-Runtime-RELEASE/mc-runtime/src/test/resources/testpackages
[INFO] 2013-07-15 14:52:27,740 [main] ERROR org.n52.movingcode.runtime.coderepository.AbstractRepository - /var/lib/jenkins/workspace/Moving-Code-Runtime-RELEASE/mc-runtime/src/test/resources/testpackages/bad_package_structure.zip is an invalid package.
[INFO] 2013-07-15 14:52:27,766 [main] INFO  org.n52.movingcode.runtime.test.MCRuntimeTestConfig - 
[INFO] Information for package: de.tu-dresden.geo.gis.algorithms.raster.ztransform
[INFO] Package Timestamp is: Mon Jul 15 14:49:47 CEST 2013
[INFO] --- Parameters ---
[INFO] Parameter 1: 0..1
[INFO] ServiceOutputID: ZTRANSFORM
[INFO] Internal Type: MEDIA
[INFO] Parameter 2: 1..1
[INFO] ServiceInputID: REFERENCE_RASTER
[INFO] Internal Type: MEDIA
[INFO] Parameter 3: 2..1000
[INFO] ServiceInputID: STATS_RASTER
[INFO] Internal Type: MEDIA
[INFO] 
[INFO] 2013-07-15 14:52:27,767 [main] INFO  org.n52.movingcode.runtime.test.MCRuntimeTestConfig - /var/lib/jenkins/workspace/Moving-Code-Runtime-RELEASE/mc-runtime/src/test/resources/testpackages
[INFO] 2013-07-15 14:52:27,786 [main] INFO  org.n52.movingcode.runtime.coderepository.AbstractRepository - Scanning directory: /var/lib/jenkins/workspace/Moving-Code-Runtime-RELEASE/mc-runtime/src/test/resources/testpackages
[INFO] 2013-07-15 14:52:27,857 [main] ERROR org.n52.movingcode.runtime.coderepository.AbstractRepository - /var/lib/jenkins/workspace/Moving-Code-Runtime-RELEASE/mc-runtime/src/test/resources/testpackages/bad_package_structure.zip is an invalid package.
[INFO] 2013-07-15 14:52:27,873 [main] INFO  org.n52.movingcode.runtime.test.MCRuntimeTestConfig - /tmp/u599phm3/g7f1if82.zip
[INFO] Tests run: 3, Failures: 0, Errors: 0, Skipped: 0, Time elapsed: 0.265 sec
[INFO] Running org.n52.movingcode.runtime.test.GeneralProcessorTest
[INFO] 2013-07-15 14:52:27,902 [main] INFO  org.n52.movingcode.runtime.test.MCRuntimeTestConfig - 
[INFO] Processor found: org.n52.movingcode.runtime.processors.java.JavaJARProcessor
[INFO] Processor found: org.n52.movingcode.runtime.processors.python.PythonCLIProcessor
[INFO] 
[INFO] Tests run: 1, Failures: 0, Errors: 0, Skipped: 0, Time elapsed: 0 sec
[INFO] Running org.n52.movingcode.runtime.test.SilentFolderUpdateTest
[INFO] 2013-07-15 14:52:27,903 [main] INFO  org.n52.movingcode.runtime.coderepository.AbstractRepository - Scanning directory: /tmp/b97ilgdc
[INFO] 2013-07-15 14:52:27,904 [main] INFO  org.n52.movingcode.runtime.test.MCRuntimeTestConfig - Copying /var/lib/jenkins/workspace/Moving-Code-Runtime-RELEASE/mc-runtime/target/test-classes/testpackages/py_copy.zip to /tmp/b97ilgdc
[INFO] 2013-07-15 14:52:32,903 [Timer-2] INFO  org.n52.movingcode.runtime.coderepository.AbstractRepository - Repository content has silently changed. Running update ...
[INFO] 2013-07-15 14:52:32,904 [Timer-2] INFO  org.n52.movingcode.runtime.test.MCRuntimeTestConfig - Received update on Repo org.n52.movingcode.runtime.coderepository.LocalZipPackageRepository@7ee49dcd
[INFO] 2013-07-15 14:52:32,904 [Timer-2] INFO  org.n52.movingcode.runtime.test.MCRuntimeTestConfig - Repos packages: []
[INFO] 2013-07-15 14:52:32,904 [Timer-2] INFO  org.n52.movingcode.runtime.coderepository.AbstractRepository - Scanning directory: /tmp/b97ilgdc
[INFO] 2013-07-15 14:52:32,908 [Timer-2] INFO  org.n52.movingcode.runtime.test.MCRuntimeTestConfig - Received update on Repo org.n52.movingcode.runtime.coderepository.LocalZipPackageRepository@7ee49dcd
[INFO] 2013-07-15 14:52:32,908 [Timer-2] INFO  org.n52.movingcode.runtime.test.MCRuntimeTestConfig - Repos packages: [tmp/b97ilgdc/py_copy]
[INFO] 2013-07-15 14:52:32,908 [Timer-2] INFO  org.n52.movingcode.runtime.test.MCRuntimeTestConfig - Expected package included in repo: tmp/b97ilgdc/py_copy
[INFO] 2013-07-15 14:52:32,908 [Timer-2] INFO  org.n52.movingcode.runtime.coderepository.AbstractRepository - Reload finished. Calling Repository Change Listeners.
[INFO] 2013-07-15 14:52:32,908 [Timer-2] INFO  org.n52.movingcode.runtime.test.MCRuntimeTestConfig - Received update on Repo org.n52.movingcode.runtime.coderepository.LocalZipPackageRepository@7ee49dcd
[INFO] 2013-07-15 14:52:32,908 [Timer-2] INFO  org.n52.movingcode.runtime.test.MCRuntimeTestConfig - Repos packages: [tmp/b97ilgdc/py_copy]
[INFO] 2013-07-15 14:52:32,908 [Timer-2] INFO  org.n52.movingcode.runtime.test.MCRuntimeTestConfig - Expected package included in repo: tmp/b97ilgdc/py_copy
[INFO] Tests run: 1, Failures: 0, Errors: 0, Skipped: 0, Time elapsed: 10.007 sec
[INFO] Running org.n52.movingcode.runtime.test.FeedConversionTest
[INFO] 2013-07-15 14:52:37,912 [main] DEBUG org.n52.movingcode.runtime.coderepository.RemoteFeedRepository - Create RemoteFeedRepository from http://141.30.100.178/gpfeed/gpfeed.xml
[INFO] 2013-07-15 14:52:37,978 [main] DEBUG org.n52.movingcode.runtime.feed.GeoprocessingFeed - Loading Feed from sun.net.www.protocol.http.HttpURLConnection$HttpInputStream@25961581
[INFO] 2013-07-15 14:52:38,100 [main] DEBUG org.apache.axiom.om.util.StAXUtils - About to create XMLInputFactory implementation with classloader=sun.misc.Launcher$AppClassLoader@12360be0
[INFO] 2013-07-15 14:52:38,100 [main] DEBUG org.apache.axiom.om.util.StAXUtils - The classloader for javax.xml.stream.XMLInputFactory is: null
[INFO] 2013-07-15 14:52:38,102 [main] DEBUG org.apache.axiom.util.stax.dialect.StAXDialectDetector - StAX implementation at jar:file:/var/data/maven-repository/org/codehaus/woodstox/wstx-asl/3.2.6/wstx-asl-3.2.6.jar!/ is:
[INFO]   Title:         WoodSToX XML-processor
[INFO]   Symbolic name: null
[INFO]   Vendor:        woodstox.codehaus.org
[INFO]   Version:       3.2.6
[INFO] 2013-07-15 14:52:38,104 [main] DEBUG org.apache.axiom.util.stax.dialect.StAXDialectDetector - Detected StAX dialect: Woodstox
[INFO] 2013-07-15 14:52:38,105 [main] DEBUG org.apache.axiom.om.util.StAXUtils - Created XMLInputFactory = class org.apache.axiom.util.stax.wrapper.ImmutableXMLInputFactory with classloader=sun.misc.Launcher$AppClassLoader@12360be0
[INFO] 2013-07-15 14:52:38,105 [main] DEBUG org.apache.axiom.om.util.StAXUtils - Configuration = ABDERA
[INFO] 2013-07-15 14:52:38,105 [main] DEBUG org.apache.axiom.om.util.StAXUtils - Size of XMLInputFactory map for this configuration = 1
[INFO] 2013-07-15 14:52:38,105 [main] DEBUG org.apache.axiom.om.util.StAXUtils - Configurations for which factories have been cached = [ABDERA]
[INFO] 2013-07-15 14:52:38,126 [main] INFO  org.n52.movingcode.runtime.feed.GeoprocessingFeed - New Feed: GeoprocessingAlgorithms
[INFO] 2013-07-15 14:52:41,125 [main] INFO  org.n52.movingcode.runtime.test.MCRuntimeTestConfig - Added Repo: http://141.30.100.178/gpfeed/gpfeed.xml
[INFO] 2013-07-15 14:52:41,126 [main] INFO  org.n52.movingcode.runtime.test.MCRuntimeTestConfig - Using temp dir /tmp/jghg6pp9
[INFO] 2013-07-15 14:52:41,151 [Timer-3] DEBUG org.n52.movingcode.runtime.feed.GeoprocessingFeed - Loading Feed from sun.net.www.protocol.http.HttpURLConnection$HttpInputStream@67f31652
[INFO] 2013-07-15 14:52:41,154 [Timer-3] INFO  org.n52.movingcode.runtime.feed.GeoprocessingFeed - New Feed: GeoprocessingAlgorithms
[INFO] 2013-07-15 14:52:43,863 [main] INFO  org.n52.movingcode.runtime.coderepository.AbstractRepository - Scanning directory: /tmp/jghg6pp9
[INFO] Tests run: 1, Failures: 0, Errors: 0, Skipped: 0, Time elapsed: 6.03 sec
[INFO] Running org.n52.movingcode.runtime.test.FeedReadTest
[INFO] 2013-07-15 14:52:43,942 [main] DEBUG org.n52.movingcode.runtime.coderepository.RemoteFeedRepository - Create RemoteFeedRepository from http://141.30.100.178/gpfeed/gpfeed.xml
[INFO] 2013-07-15 14:52:43,967 [main] DEBUG org.n52.movingcode.runtime.feed.GeoprocessingFeed - Loading Feed from sun.net.www.protocol.http.HttpURLConnection$HttpInputStream@658f7386
[INFO] 2013-07-15 14:52:43,969 [main] INFO  org.n52.movingcode.runtime.feed.GeoprocessingFeed - New Feed: GeoprocessingAlgorithms
[INFO] 2013-07-15 14:52:46,644 [main] INFO  org.n52.movingcode.runtime.test.MCRuntimeTestConfig - Added Repo: http://141.30.100.178/gpfeed/gpfeed.xml
[INFO] 2013-07-15 14:52:46,668 [main] INFO  org.n52.movingcode.runtime.test.MCRuntimeTestConfig - 
[INFO] 
[INFO] Found process: src/test/resources/testpackages:var/lib/jenkins/workspace/Moving-Code-Runtime-RELEASE/mc-runtime/src/test/resources/testpackages/arcgis_ndvi_tbx
[INFO] Couldn't get a processor for package src/test/resources/testpackages:var/lib/jenkins/workspace/Moving-Code-Runtime-RELEASE/mc-runtime/src/test/resources/testpackages/arcgis_ndvi_tbx
[INFO] 
[INFO] Found process: src/test/resources/testpackages:var/lib/jenkins/workspace/Moving-Code-Runtime-RELEASE/mc-runtime/src/test/resources/testpackages/py_geca
[INFO] Compatible Processors: org.n52.movingcode.runtime.processors.python.PythonCLIProcessor
[INFO] --- Parameters ---
[INFO] Parameter 1: 1..1
[INFO] ServiceInputID: satellite_a
[INFO] Internal Type: STRING
[INFO] Parameter 2: 1..1
[INFO] ServiceInputID: satellite_b
[INFO] Internal Type: STRING
[INFO] Parameter 3: 1..1
[INFO] ServiceInputID: CollocationCriteria_dt
[INFO] Internal Type: STRING
[INFO] Parameter 4: 1..1
[INFO] ServiceInputID: CollocationCriteria_dp
[INFO] Internal Type: STRING
[INFO] Parameter 5: 1..1
[INFO] ServiceInputID: ResamplingScheme
[INFO] Internal Type: STRING
[INFO] Parameter 6: 1..1
[INFO] ServiceInputID: ResamplingMaster
[INFO] Internal Type: STRING
[INFO] Parameter 7: 0..1
[INFO] ServiceOutputID: PDF
[INFO] Internal Type: MEDIA
[INFO] Parameter 8: 0..1
[INFO] ServiceOutputID: ZIP
[INFO] Internal Type: MEDIA
[INFO] 
[INFO] Found process: src/test/resources/testpackages:var/lib/jenkins/workspace/Moving-Code-Runtime-RELEASE/mc-runtime/src/test/resources/testpackages/jar_copy
[INFO] Compatible Processors: org.n52.movingcode.runtime.processors.java.JavaJARProcessor
[INFO] --- Parameters ---
[INFO] Parameter 1: 1..1
[INFO] ServiceInputID: CALL
[INFO] Internal Type: MEDIA
[INFO] Parameter 2: 0..1
[INFO] ServiceOutputID: RESPONSE
[INFO] Internal Type: MEDIA
[INFO] 
[INFO] Found process: src/test/resources/testpackages:var/lib/jenkins/workspace/Moving-Code-Runtime-RELEASE/mc-runtime/src/test/resources/testpackages/ztransform
[INFO] Compatible Processors: org.n52.movingcode.runtime.processors.python.PythonCLIProcessor
[INFO] --- Parameters ---
[INFO] Parameter 1: 0..1
[INFO] ServiceOutputID: ZTRANSFORM
[INFO] Internal Type: MEDIA
[INFO] Parameter 2: 1..1
[INFO] ServiceInputID: REFERENCE_RASTER
[INFO] Internal Type: MEDIA
[INFO] Parameter 3: 2..1000
[INFO] ServiceInputID: STATS_RASTER
[INFO] Internal Type: MEDIA
[INFO] 
[INFO] Found process: src/test/resources/testpackages:var/lib/jenkins/workspace/Moving-Code-Runtime-RELEASE/mc-runtime/src/test/resources/testpackages/py_copy
[INFO] Compatible Processors: org.n52.movingcode.runtime.processors.python.PythonCLIProcessor
[INFO] --- Parameters ---
[INFO] Parameter 1: 1..1
[INFO] ServiceInputID: CALL
[INFO] Internal Type: MEDIA
[INFO] Parameter 2: 0..1
[INFO] ServiceOutputID: RESPONSE
[INFO] Internal Type: MEDIA
[INFO] 
[INFO] Found process: http://141.30.100.178/gpfeed/gpfeed.xml:de.tu-dresden.geo.gis.algorithms.test.echo
[INFO] Compatible Processors: org.n52.movingcode.runtime.processors.java.JavaJARProcessor
[INFO] --- Parameters ---
[INFO] Parameter 1: 1..1
[INFO] ServiceInputID: CALL
[INFO] Internal Type: MEDIA
[INFO] Parameter 2: 0..1
[INFO] ServiceOutputID: RESPONSE
[INFO] Internal Type: MEDIA
[INFO] 
[INFO] Found process: http://141.30.100.178/gpfeed/gpfeed.xml:de.tu-dresden.geo.gis.algorithms.test.ndvi
[INFO] Couldn't get a processor for package http://141.30.100.178/gpfeed/gpfeed.xml:de.tu-dresden.geo.gis.algorithms.test.ndvi
[INFO] 
[INFO] Found process: http://141.30.100.178/gpfeed/gpfeed.xml:de.tu-dresden.geo.gis.algorithms.raster.ztransform
[INFO] Compatible Processors: org.n52.movingcode.runtime.processors.python.PythonCLIProcessor
[INFO] --- Parameters ---
[INFO] Parameter 1: 0..1
[INFO] ServiceOutputID: ZTRANSFORM
[INFO] Internal Type: MEDIA
[INFO] Parameter 2: 1..1
[INFO] ServiceInputID: REFERENCE_RASTER
[INFO] Internal Type: MEDIA
[INFO] Parameter 3: 2..1000
[INFO] ServiceInputID: STATS_RASTER
[INFO] Internal Type: MEDIA
[INFO] 
[INFO] Tests run: 1, Failures: 0, Errors: 0, Skipped: 0, Time elapsed: 2.725 sec
[INFO] 2013-07-15 14:52:46,669 [Timer-5] DEBUG org.n52.movingcode.runtime.feed.GeoprocessingFeed - Loading Feed from sun.net.www.protocol.http.HttpURLConnection$HttpInputStream@5bf0aecc
[INFO] 2013-07-15 14:52:46,670 [Timer-5] INFO  org.n52.movingcode.runtime.feed.GeoprocessingFeed - New Feed: GeoprocessingAlgorithms
[INFO] 
[INFO] Results :
[INFO] 
[INFO] Tests run: 18, Failures: 0, Errors: 0, Skipped: 0
[INFO] 
[INFO] [INFO] 
[INFO] [INFO] --- maven-license-plugin:1.9.0:check (default) @ mc-runtime ---
[INFO] [INFO] Checking licenses...
[INFO] [INFO] 
[INFO] [INFO] --- maven-jar-plugin:2.4:jar (default-jar) @ mc-runtime ---
[INFO] [INFO] Building jar: /var/lib/jenkins/workspace/Moving-Code-Runtime-RELEASE/mc-runtime/target/mc-runtime-0.6.jar
[INFO] [INFO] ------------------------------------------------------------------------
[INFO] [INFO] Reactor Summary:
[INFO] [INFO] 
[INFO] [INFO] Moving Code Runtime Reactor ....................... SUCCESS [0.069s]
[INFO] [INFO] mc-xml-processors ................................. SUCCESS [1.774s]
[INFO] [INFO] 52North Moving Code Runtime ....................... SUCCESS [21.295s]
[INFO] [INFO] ------------------------------------------------------------------------
[INFO] [INFO] BUILD SUCCESS
[INFO] [INFO] ------------------------------------------------------------------------
[INFO] [INFO] Total time: 23.611s
[INFO] [INFO] Finished at: Mon Jul 15 14:52:46 CEST 2013
[INFO] [INFO] Final Memory: 18M/161M
[INFO] [INFO] ------------------------------------------------------------------------
[INFO] Checking in modified POMs...
[INFO] Executing: /bin/sh -c cd /var/lib/jenkins/workspace/Moving-Code-Runtime-RELEASE && svn --non-interactive commit --file /tmp/maven-scm-794121326.commit --targets /tmp/maven-scm-2635599980089492750-targets
[INFO] Working directory: /var/lib/jenkins/workspace/Moving-Code-Runtime-RELEASE
[INFO] ------------------------------------------------------------------------
[INFO] Reactor Summary:
[INFO] 
[INFO] Moving Code Runtime Reactor ....................... FAILURE [28.806s]
[INFO] mc-xml-processors ................................. SKIPPED
[INFO] 52North Moving Code Runtime ....................... SKIPPED
[INFO] ------------------------------------------------------------------------
[INFO] BUILD FAILURE
[INFO] ------------------------------------------------------------------------
[INFO] Total time: 29.525s
[INFO] Finished at: Mon Jul 15 14:52:49 CEST 2013
[INFO] Final Memory: 6M/58M
[INFO] ------------------------------------------------------------------------
[JENKINS] Archiving /var/lib/jenkins/workspace/Moving-Code-Runtime-RELEASE/mc-runtime/pom.xml to /var/lib/jenkins/jobs/Moving-Code-Runtime-RELEASE/modules/org.n52.mc$mc-runtime/builds/2013-07-15_14-52-17/archive/org.n52.mc/mc-runtime/0.6-SNAPSHOT/mc-runtime-0.6-SNAPSHOT.pom
[JENKINS] Archiving /var/lib/jenkins/workspace/Moving-Code-Runtime-RELEASE/mc-xml-processors/pom.xml to /var/lib/jenkins/jobs/Moving-Code-Runtime-RELEASE/modules/org.n52.mc$mc-xml-processors/builds/2013-07-15_14-52-17/archive/org.n52.mc/mc-xml-processors/0.6-SNAPSHOT/mc-xml-processors-0.6-SNAPSHOT.pom
[JENKINS] Archiving /var/lib/jenkins/workspace/Moving-Code-Runtime-RELEASE/pom.xml to /var/lib/jenkins/jobs/Moving-Code-Runtime-RELEASE/modules/org.n52.mc$movingcode-runtime-parent/builds/2013-07-15_14-52-17/archive/org.n52.mc/movingcode-runtime-parent/0.6-SNAPSHOT/movingcode-runtime-parent-0.6-SNAPSHOT.pom
Waiting for Jenkins to finish collecting data
mavenExecutionResult exceptions not empty
message : Failed to execute goal org.apache.maven.plugins:maven-release-plugin:2.1:prepare (default-cli) on project movingcode-runtime-parent: Unable to commit files
Provider message:
The svn command failed.
Command output:
svn: Commit failed (details follow):
svn: MKACTIVITY of '/svn/geoprocessing/!svn/act/783b189c-78bf-48d4-96f2-412761a32fee': authorization failed: Could not authenticate to server: rejected Basic challenge (https://svn.52north.org)

cause : Unable to commit files
Provider message:
The svn command failed.
Command output:
svn: Commit failed (details follow):
svn: MKACTIVITY of '/svn/geoprocessing/!svn/act/783b189c-78bf-48d4-96f2-412761a32fee': authorization failed: Could not authenticate to server: rejected Basic challenge (https://svn.52north.org)

Stack trace : 
org.apache.maven.lifecycle.LifecycleExecutionException: Failed to execute goal org.apache.maven.plugins:maven-release-plugin:2.1:prepare (default-cli) on project movingcode-runtime-parent: Unable to commit files
Provider message:
The svn command failed.
Command output:
svn: Commit failed (details follow):
svn: MKACTIVITY of '/svn/geoprocessing/!svn/act/783b189c-78bf-48d4-96f2-412761a32fee': authorization failed: Could not authenticate to server: rejected Basic challenge (https://svn.52north.org)

	at org.apache.maven.lifecycle.internal.MojoExecutor.execute(MojoExecutor.java:213)
	at org.apache.maven.lifecycle.internal.MojoExecutor.execute(MojoExecutor.java:153)
	at org.apache.maven.lifecycle.internal.MojoExecutor.execute(MojoExecutor.java:145)
	at org.apache.maven.lifecycle.internal.LifecycleModuleBuilder.buildProject(LifecycleModuleBuilder.java:84)
	at org.apache.maven.lifecycle.internal.LifecycleModuleBuilder.buildProject(LifecycleModuleBuilder.java:59)
	at org.apache.maven.lifecycle.internal.LifecycleStarter.singleThreadedBuild(LifecycleStarter.java:183)
	at org.apache.maven.lifecycle.internal.LifecycleStarter.execute(LifecycleStarter.java:161)
	at org.apache.maven.DefaultMaven.doExecute(DefaultMaven.java:320)
	at org.apache.maven.DefaultMaven.execute(DefaultMaven.java:156)
	at org.jvnet.hudson.maven3.launcher.Maven3Launcher.main(Maven3Launcher.java:79)
	at sun.reflect.NativeMethodAccessorImpl.invoke0(Native Method)
	at sun.reflect.NativeMethodAccessorImpl.invoke(NativeMethodAccessorImpl.java:39)
	at sun.reflect.DelegatingMethodAccessorImpl.invoke(DelegatingMethodAccessorImpl.java:25)
	at java.lang.reflect.Method.invoke(Method.java:597)
	at org.codehaus.plexus.classworlds.launcher.Launcher.launchStandard(Launcher.java:329)
	at org.codehaus.plexus.classworlds.launcher.Launcher.launch(Launcher.java:239)
	at org.jvnet.hudson.maven3.agent.Maven3Main.launch(Maven3Main.java:158)
	at hudson.maven.Maven3Builder.call(Maven3Builder.java:100)
	at hudson.maven.Maven3Builder.call(Maven3Builder.java:66)
	at hudson.remoting.UserRequest.perform(UserRequest.java:118)
	at hudson.remoting.UserRequest.perform(UserRequest.java:48)
	at hudson.remoting.Request$2.run(Request.java:326)
	at hudson.remoting.InterceptingExecutorService$1.call(InterceptingExecutorService.java:72)
	at java.util.concurrent.FutureTask$Sync.innerRun(FutureTask.java:303)
	at java.util.concurrent.FutureTask.run(FutureTask.java:138)
	at java.util.concurrent.ThreadPoolExecutor$Worker.runTask(ThreadPoolExecutor.java:886)
	at java.util.concurrent.ThreadPoolExecutor$Worker.run(ThreadPoolExecutor.java:908)
	at java.lang.Thread.run(Thread.java:662)
Caused by: org.apache.maven.plugin.MojoFailureException: Unable to commit files
Provider message:
The svn command failed.
Command output:
svn: Commit failed (details follow):
svn: MKACTIVITY of '/svn/geoprocessing/!svn/act/783b189c-78bf-48d4-96f2-412761a32fee': authorization failed: Could not authenticate to server: rejected Basic challenge (https://svn.52north.org)

	at org.apache.maven.plugins.release.PrepareReleaseMojo.prepareRelease(PrepareReleaseMojo.java:287)
	at org.apache.maven.plugins.release.PrepareReleaseMojo.execute(PrepareReleaseMojo.java:237)
	at org.apache.maven.plugin.DefaultBuildPluginManager.executeMojo(DefaultBuildPluginManager.java:101)
	at org.apache.maven.lifecycle.internal.MojoExecutor.execute(MojoExecutor.java:209)
	... 27 more
Caused by: org.apache.maven.shared.release.scm.ReleaseScmCommandException: Unable to commit files
Provider message:
The svn command failed.
Command output:
svn: Commit failed (details follow):
svn: MKACTIVITY of '/svn/geoprocessing/!svn/act/783b189c-78bf-48d4-96f2-412761a32fee': authorization failed: Could not authenticate to server: rejected Basic challenge (https://svn.52north.org)

	at org.apache.maven.shared.release.phase.AbstractScmCommitPhase.checkin(AbstractScmCommitPhase.java:168)
	at org.apache.maven.shared.release.phase.AbstractScmCommitPhase.performCheckins(AbstractScmCommitPhase.java:148)
	at org.apache.maven.shared.release.phase.ScmCommitPreparationPhase.runLogic(ScmCommitPreparationPhase.java:75)
	at org.apache.maven.shared.release.phase.AbstractScmCommitPhase.execute(AbstractScmCommitPhase.java:79)
	at org.apache.maven.shared.release.DefaultReleaseManager.prepare(DefaultReleaseManager.java:203)
	at org.apache.maven.shared.release.DefaultReleaseManager.prepare(DefaultReleaseManager.java:140)
	at org.apache.maven.shared.release.DefaultReleaseManager.prepare(DefaultReleaseManager.java:103)
	at org.apache.maven.plugins.release.PrepareReleaseMojo.prepareRelease(PrepareReleaseMojo.java:279)
	... 30 more
Sending e-mails to: geoprocessing-commits@52north.org
channel stopped
Sending e-mails to: geoprocessing-commits@52north.org
Finished: FAILURE