Console Output

Started by user BenjaminPross
Building in workspace /var/lib/jenkins/workspace/Moving-Code-Runtime-RELEASE
 > git rev-parse --is-inside-work-tree # timeout=10
Fetching changes from the remote Git repository
 > git config remote.origin.url ssh://git@github.com/52North/movingcode.git # timeout=10
Fetching upstream changes from ssh://git@github.com/52North/movingcode.git
 > git --version # timeout=10
using GIT_SSH to set credentials 52n Jenkins CI user on GitHub
 > git -c core.askpass=true fetch --tags --progress ssh://git@github.com/52North/movingcode.git +refs/heads/master:refs/remotes/origin/master
 > git rev-parse origin/master^{commit} # timeout=10
Checking out Revision a4152a3b02ab70e4a4095303efb9e526dd21c7c9 (origin/master)
 > git config core.sparsecheckout # timeout=10
 > git checkout -f a4152a3b02ab70e4a4095303efb9e526dd21c7c9 # timeout=10
 > git branch -a -v --no-abbrev # timeout=10
 > git branch -D master # timeout=10
 > git checkout -b master a4152a3b02ab70e4a4095303efb9e526dd21c7c9
 > git rev-list a4152a3b02ab70e4a4095303efb9e526dd21c7c9 # timeout=10
Parsing POMs
Modules changed, recalculating dependency graph
Established TCP socket on 48669
[Moving-Code-Runtime-RELEASE] $ java -Xmx1024m -XX:MaxPermSize=1024m -cp /var/lib/jenkins/plugins/maven-plugin/WEB-INF/lib/maven3-agent-1.7.jar:/var/lib/jenkins/tools/hudson.tasks.Maven_MavenInstallation/Maven_3.0.x/boot/plexus-classworlds-2.4.jar org.jvnet.hudson.maven3.agent.Maven3Main /var/lib/jenkins/tools/hudson.tasks.Maven_MavenInstallation/Maven_3.0.x /var/cache/jenkins/war/WEB-INF/lib/remoting-2.56.jar /var/lib/jenkins/plugins/maven-plugin/WEB-INF/lib/maven3-interceptor-1.7.jar /var/lib/jenkins/plugins/maven-plugin/WEB-INF/lib/maven3-interceptor-commons-1.7.jar 48669
Java HotSpot(TM) 64-Bit Server VM warning: ignoring option MaxPermSize=1024m; support was removed in 8.0
<===[JENKINS REMOTING CAPACITY]===>channel started
Executing Maven:  -B -f /var/lib/jenkins/workspace/Moving-Code-Runtime-RELEASE/pom.xml -DdevelopmentVersion=1.2-SNAPSHOT -DreleaseVersion=1.1 -Dresume=false release:prepare release:perform -Denv=release
[INFO] Scanning for projects...
[INFO] ------------------------------------------------------------------------
[INFO] Reactor Build Order:
[INFO] 
[INFO] Moving Code Framework
[INFO] Moving Code XML Schema
[INFO] Moving Code Runtime
[INFO] Code Package Feed
[INFO]                                                                         
[INFO] ------------------------------------------------------------------------
[INFO] Building Moving Code Framework 1.1-SNAPSHOT
[INFO] ------------------------------------------------------------------------
[INFO] 
[INFO] --- maven-release-plugin:2.1:prepare (default-cli) @ movingcode-parent ---
[INFO] Verifying that there are no local modifications...
[INFO]   ignoring changes on: pom.xml.next, pom.xml.releaseBackup, pom.xml.tag, pom.xml.backup, pom.xml.branch, release.properties
[INFO] Executing: /bin/sh -c cd /var/lib/jenkins/workspace/Moving-Code-Runtime-RELEASE && git status
[INFO] Working directory: /var/lib/jenkins/workspace/Moving-Code-Runtime-RELEASE
[INFO] Checking dependencies and plugins for snapshots ...
[INFO] Transforming 'Moving Code Framework'...
[INFO] Updating mc-runtime to 1.1
[INFO] Ignoring artifact version update for expression: ${project.version}
[INFO] Updating mc-schema to 1.1
[INFO] Ignoring artifact version update for expression: ${project.version}
[INFO] Transforming 'Moving Code XML Schema'...
[INFO] Transforming 'Moving Code Runtime'...
[INFO] Updating mc-schema to 1.1
[INFO] Transforming 'Code Package Feed'...
[INFO] Updating mc-runtime to 1.1
[INFO] Not generating release POMs
[INFO] Executing goals 'clean verify'...
[INFO] Java HotSpot(TM) 64-Bit Server VM warning: ignoring option MaxPermSize=1024m; support was removed in 8.0
[INFO] [INFO] Scanning for projects...
[INFO] [INFO] ------------------------------------------------------------------------
[INFO] [INFO] Reactor Build Order:
[INFO] [INFO] 
[INFO] [INFO] Moving Code Framework
[INFO] [INFO] Moving Code XML Schema
[INFO] [INFO] Moving Code Runtime
[INFO] [INFO] Code Package Feed
[INFO] [INFO]                                                                         
[INFO] [INFO] ------------------------------------------------------------------------
[INFO] [INFO] Building Moving Code Framework 1.1
[INFO] [INFO] ------------------------------------------------------------------------
[INFO] [INFO] 
[INFO] [INFO] --- maven-clean-plugin:2.4.1:clean (default-clean) @ movingcode-parent ---
[INFO] [INFO]                                                                         
[INFO] [INFO] ------------------------------------------------------------------------
[INFO] [INFO] Building Moving Code XML Schema 1.1
[INFO] [INFO] ------------------------------------------------------------------------
[INFO] [INFO] 
[INFO] [INFO] --- maven-clean-plugin:2.4.1:clean (default-clean) @ mc-schema ---
[INFO] [INFO] Deleting /mnt/extra/jenkins/workspace/Moving-Code-Runtime-RELEASE/mc-schema/target
[INFO] [INFO] 
[INFO] [INFO] --- xmlbeans-maven-plugin:2.3.3:xmlbeans (default) @ mc-schema ---
[INFO] [INFO] 
[INFO] [INFO] --- maven-resources-plugin:2.5:resources (default-resources) @ mc-schema ---
[INFO] [debug] execute contextualize
[INFO] [INFO] Using 'UTF-8' encoding to copy filtered resources.
[INFO] [INFO] skip non existing resourceDirectory /mnt/extra/jenkins/workspace/Moving-Code-Runtime-RELEASE/mc-schema/src/main/resources
[INFO] [INFO] Copying 252 resources
[INFO] [INFO] 
[INFO] [INFO] --- maven-compiler-plugin:2.5.1:compile (default-compile) @ mc-schema ---
[INFO] [INFO] Nothing to compile - all classes are up to date
[INFO] [INFO] 
[INFO] [INFO] --- maven-resources-plugin:2.5:testResources (default-testResources) @ mc-schema ---
[INFO] [debug] execute contextualize
[INFO] [INFO] Using 'UTF-8' encoding to copy filtered resources.
[INFO] [INFO] skip non existing resourceDirectory /mnt/extra/jenkins/workspace/Moving-Code-Runtime-RELEASE/mc-schema/src/test/resources
[INFO] [INFO] 
[INFO] [INFO] --- maven-compiler-plugin:2.5.1:testCompile (default-testCompile) @ mc-schema ---
[INFO] [INFO] No sources to compile
[INFO] [INFO] 
[INFO] [INFO] --- maven-surefire-plugin:2.12.4:test (default-test) @ mc-schema ---
[INFO] [INFO] Tests are skipped.
[INFO] [INFO] 
[INFO] [INFO] --- maven-jar-plugin:2.4:jar (default-jar) @ mc-schema ---
[INFO] [INFO] Building jar: /mnt/extra/jenkins/workspace/Moving-Code-Runtime-RELEASE/mc-schema/target/mc-schema-1.1.jar
[INFO] [INFO]                                                                         
[INFO] [INFO] ------------------------------------------------------------------------
[INFO] [INFO] Building Moving Code Runtime 1.1
[INFO] [INFO] ------------------------------------------------------------------------
[INFO] [INFO] 
[INFO] [INFO] --- maven-clean-plugin:2.4.1:clean (default-clean) @ mc-runtime ---
[INFO] [INFO] Deleting /mnt/extra/jenkins/workspace/Moving-Code-Runtime-RELEASE/mc-runtime/target
[INFO] [INFO] 
[INFO] [INFO] --- license-maven-plugin:2.8:check (default) @ mc-runtime ---
[INFO] [INFO] Checking licenses...
[INFO] [INFO] 
[INFO] [INFO] --- maven-resources-plugin:2.5:resources (default-resources) @ mc-runtime ---
[INFO] [debug] execute contextualize
[INFO] [INFO] Using 'UTF-8' encoding to copy filtered resources.
[INFO] [INFO] Copying 6 resources
[INFO] [INFO] 
[INFO] [INFO] --- maven-compiler-plugin:2.5.1:compile (default-compile) @ mc-runtime ---
[INFO] [INFO] Compiling 53 source files to /mnt/extra/jenkins/workspace/Moving-Code-Runtime-RELEASE/mc-runtime/target/classes
[INFO] [INFO] 
[INFO] [INFO] --- maven-compiler-plugin:2.5.1:testCompile (test-compile) @ mc-runtime ---
[INFO] [INFO] Compiling 17 source files to /mnt/extra/jenkins/workspace/Moving-Code-Runtime-RELEASE/mc-runtime/target/test-classes
[INFO] [INFO] 
[INFO] [INFO] --- maven-resources-plugin:2.5:testResources (default-testResources) @ mc-runtime ---
[INFO] [debug] execute contextualize
[INFO] [INFO] Using 'UTF-8' encoding to copy filtered resources.
[INFO] [INFO] Copying 27 resources
[INFO] [INFO] 
[INFO] [INFO] --- maven-compiler-plugin:2.5.1:testCompile (default-testCompile) @ mc-runtime ---
[INFO] [INFO] Nothing to compile - all classes are up to date
[INFO] [INFO] 
[INFO] [INFO] --- maven-surefire-plugin:2.12.4:test (default-test) @ mc-runtime ---
[INFO] [INFO] Surefire report directory: /mnt/extra/jenkins/workspace/Moving-Code-Runtime-RELEASE/mc-runtime/target/surefire-reports
[INFO] 
[INFO] -------------------------------------------------------
[INFO]  T E S T S
[INFO] -------------------------------------------------------
[INFO] Running org.n52.movingcode.runtime.test.ValidatePackageTest
[INFO] 12:13:21.115 [main] INFO  o.n.m.r.test.MCRuntimeTestConfig - /mnt/extra/jenkins/workspace/Moving-Code-Runtime-RELEASE/mc-runtime/src/test/resources/testpackages/ztransform.zip
[INFO] Tests run: 2, Failures: 0, Errors: 0, Skipped: 0, Time elapsed: 0.38 sec
[INFO] Running org.n52.movingcode.runtime.test.FeedReadTest
[INFO] 12:13:21.416 [main] DEBUG o.n.m.r.c.AbstractRepository - Create RemoteFeedRepository from http://141.30.100.178/gpfeed2/gpfeed.xml
[INFO] 12:13:21.468 [main] DEBUG o.n.m.runtime.feed.CodePackageFeed - Loading Feed from sun.net.www.protocol.http.HttpURLConnection$HttpInputStream@657c8ad9
[INFO] 12:13:21.638 [main] INFO  o.n.m.runtime.feed.CodePackageFeed - New Feed: GeoprocessingAlgorithms
[INFO] 12:13:23.940 [main] DEBUG o.n.m.r.c.AbstractRepository - Loading package for feed entry de.tu-dresden.geo.gis.algorithms.test.ndvi
[INFO] 12:13:24.021 [main] DEBUG o.n.m.r.c.AbstractRepository - Loading package for feed entry de.tu-dresden.geo.gis.algorithms.raster.ztransform
[INFO] 12:13:24.093 [main] DEBUG o.n.m.r.c.AbstractRepository - Loading package for feed entry de.tu-dresden.geo.gis.algorithms.test.echo
[INFO] 12:13:24.163 [main] DEBUG o.n.m.r.c.AbstractRepository - Loading package for feed entry de.tu-dresden.geo.gis.algorithms.test.echo
[INFO] 12:13:24.172 [main] INFO  o.n.m.r.test.MCRuntimeTestConfig - Added Repo: http://141.30.100.178/gpfeed2/gpfeed.xml
[INFO] 12:13:24.191 [Timer-0] DEBUG o.n.m.runtime.feed.CodePackageFeed - Loading Feed from sun.net.www.protocol.http.HttpURLConnection$HttpInputStream@4dd97c40
[INFO] 12:13:24.192 [Timer-0] INFO  o.n.m.runtime.feed.CodePackageFeed - New Feed: GeoprocessingAlgorithms
[INFO] 12:13:24.193 [Timer-0] INFO  o.n.m.r.c.AbstractRepository - Reload finished.
[INFO] 12:13:24.205 [main] DEBUG o.n.m.r.processors.ProcessorFactory - Could not find a suitable processor for package: org.n52.movingcode.runtime.test.arctoolbox_ndvi_2014-07-08T09:00:00.000Z
[INFO] 12:13:24.206 [main] DEBUG o.n.m.r.processors.ProcessorFactory - Creating new processor for package: org.n52.movingcode.runtime.test.ztransform_2014-07-08T09:00:00.000Z
[INFO] 12:13:24.228 [main] DEBUG o.n.m.r.processors.ProcessorFactory - Creating new processor for package: org.n52.movingcode.runtime.test.jar_copy_2014-07-08T09:00:00.000Z
[INFO] 12:13:24.231 [main] INFO  o.n.m.r.test.MCRuntimeTestConfig - 
[INFO] 
[INFO] Found process: org.n52.movingcode.runtime.test.arctoolbox_ndvi_2014-07-08T09:00:00.000Z
[INFO] Couldn't get a processor for package org.n52.movingcode.runtime.test.arctoolbox_ndvi_2014-07-08T09:00:00.000Z
[INFO] 
[INFO] Found process: org.n52.movingcode.runtime.test.ztransform_2014-07-08T09:00:00.000Z
[INFO] Compatible Processors: org.n52.movingcode.runtime.processors.python.PythonCLIProcessor
[INFO] --- Parameters ---
[INFO] Parameter 1: 0..1
[INFO] ServiceOutputID: ZTRANSFORM
[INFO] Internal Type: MEDIA
[INFO] Parameter 2: 1..1
[INFO] ServiceInputID: REFERENCE_RASTER
[INFO] Internal Type: MEDIA
[INFO] Parameter 3: 2..1000
[INFO] ServiceInputID: STATS_RASTER
[INFO] Internal Type: MEDIA
[INFO] 
[INFO] Found process: org.n52.movingcode.runtime.test.jar_copy_2014-07-08T09:00:00.000Z
[INFO] Compatible Processors: org.n52.movingcode.runtime.processors.java.JavaJARProcessor
[INFO] --- Parameters ---
[INFO] Parameter 1: 1..1
[INFO] ServiceInputID: CALL
[INFO] Internal Type: MEDIA
[INFO] Parameter 2: 0..1
[INFO] ServiceOutputID: RESPONSE
[INFO] Internal Type: MEDIA
[INFO] 
[INFO] Tests run: 1, Failures: 0, Errors: 0, Skipped: 0, Time elapsed: 2.821 sec
[INFO] Running org.n52.movingcode.runtime.test.MovingCodeRepositoryTests
[INFO] 12:13:24.235 [main] INFO  o.n.m.r.test.MCRuntimeTestConfig - /mnt/extra/jenkins/workspace/Moving-Code-Runtime-RELEASE/mc-runtime/src/test/resources/testpackages
[INFO] 12:13:24.245 [main] INFO  o.n.m.r.c.AbstractRepository - Scanning directory: /mnt/extra/jenkins/workspace/Moving-Code-Runtime-RELEASE/mc-runtime/src/test/resources/testpackages
[INFO] 12:13:24.245 [main] DEBUG o.n.m.r.c.AbstractRepository - Found package: src/test/resources/testpackages/ztransform.zip
[INFO] 12:13:24.251 [main] DEBUG o.n.m.r.c.AbstractRepository - Registered package: src/test/resources/testpackages/ztransform.zip; using ID: org.n52.movingcode.runtime.test.ztransform_2014-07-08T09:00:00.000Z
[INFO] 12:13:24.251 [main] DEBUG o.n.m.r.c.AbstractRepository - Found package: src/test/resources/testpackages/py_copy.zip
[INFO] 12:13:24.256 [main] DEBUG o.n.m.r.c.AbstractRepository - Registered package: src/test/resources/testpackages/py_copy.zip; using ID: org.n52.movingcode.runtime.test.py_copy_2014-07-08T09:00:00.000Z
[INFO] 12:13:24.256 [main] DEBUG o.n.m.r.c.AbstractRepository - Found package: src/test/resources/testpackages/py_geca.zip
[INFO] 12:13:24.267 [main] DEBUG o.n.m.r.c.AbstractRepository - Registered package: src/test/resources/testpackages/py_geca.zip; using ID: org.n52.movingcode.runtime.test.py_geca_2014-07-08T09:00:00.000Z
[INFO] 12:13:24.267 [main] DEBUG o.n.m.r.c.AbstractRepository - Found package: src/test/resources/testpackages/arctoolbox_ndvi.zip
[INFO] 12:13:24.272 [main] DEBUG o.n.m.r.c.AbstractRepository - Registered package: src/test/resources/testpackages/arctoolbox_ndvi.zip; using ID: org.n52.movingcode.runtime.test.arctoolbox_ndvi_2014-07-08T09:00:00.000Z
[INFO] 12:13:24.273 [main] DEBUG o.n.m.r.c.AbstractRepository - Found package: src/test/resources/testpackages/jar_copy.zip
[INFO] 12:13:24.277 [main] DEBUG o.n.m.r.c.AbstractRepository - Registered package: src/test/resources/testpackages/jar_copy.zip; using ID: org.n52.movingcode.runtime.test.jar_copy_2014-07-08T09:00:00.000Z
[INFO] 12:13:24.278 [main] DEBUG o.n.m.r.test.MCRuntimeTestConfig - Retrieving process: de.tu-dresden.geo.gis.algorithms.raster.ztransform
[INFO] 12:13:24.282 [main] DEBUG o.n.m.r.test.MCRuntimeTestConfig - Found package: org.n52.movingcode.runtime.test.ztransform_2014-07-08T09:00:00.000Z supplying process de.tu-dresden.geo.gis.algorithms.raster.ztransform
[INFO] 12:13:24.283 [main] DEBUG o.n.m.r.processors.ProcessorFactory - Creating new processor for package: org.n52.movingcode.runtime.test.ztransform_2014-07-08T09:00:00.000Z
[INFO] 12:13:24.285 [main] INFO  o.n.m.r.test.MCRuntimeTestConfig - 
[INFO] --- Parameters ---
[INFO] Parameter 1: 0..1
[INFO] ServiceOutputID: ZTRANSFORM
[INFO] Internal Type: MEDIA
[INFO] Parameter 2: 1..1
[INFO] ServiceInputID: REFERENCE_RASTER
[INFO] Internal Type: MEDIA
[INFO] Parameter 3: 2..1000
[INFO] ServiceInputID: STATS_RASTER
[INFO] Internal Type: MEDIA
[INFO] 
[INFO] 12:13:24.285 [main] INFO  o.n.m.r.test.MCRuntimeTestConfig - Adding plain folder repo: /mnt/extra/jenkins/workspace/Moving-Code-Runtime-RELEASE/mc-runtime/src/test/resources/testpackages
[INFO] 12:13:24.292 [main] INFO  o.n.m.r.c.AbstractRepository - Scanning directory: /mnt/extra/jenkins/workspace/Moving-Code-Runtime-RELEASE/mc-runtime/src/test/resources/testpackages
[INFO] 12:13:24.296 [main] INFO  o.n.m.r.c.AbstractRepository - Found package: /mnt/extra/jenkins/workspace/Moving-Code-Runtime-RELEASE/mc-runtime/src/test/resources/testpackages/jar_copy; using ID: org.n52.movingcode.runtime.test.jar_copy_2014-07-08T09:00:00.000Z
[INFO] 12:13:24.299 [main] INFO  o.n.m.r.c.AbstractRepository - Found package: /mnt/extra/jenkins/workspace/Moving-Code-Runtime-RELEASE/mc-runtime/src/test/resources/testpackages/py_copy; using ID: org.n52.movingcode.runtime.test.py_copy_2014-07-08T09:00:00.000Z
[INFO] 12:13:24.303 [main] INFO  o.n.m.r.c.AbstractRepository - Found package: /mnt/extra/jenkins/workspace/Moving-Code-Runtime-RELEASE/mc-runtime/src/test/resources/testpackages/py_geca; using ID: org.n52.movingcode.runtime.test.py_geca_2014-07-08T09:00:00.000Z
[INFO] 12:13:24.306 [main] INFO  o.n.m.r.c.AbstractRepository - Found package: /mnt/extra/jenkins/workspace/Moving-Code-Runtime-RELEASE/mc-runtime/src/test/resources/testpackages/ztransform; using ID: org.n52.movingcode.runtime.test.ztransform_2014-07-08T09:00:00.000Z
[INFO] 12:13:24.308 [main] INFO  o.n.m.r.c.AbstractRepository - Found package: /mnt/extra/jenkins/workspace/Moving-Code-Runtime-RELEASE/mc-runtime/src/test/resources/testpackages/arctoolbox_ndvi; using ID: org.n52.movingcode.runtime.test.arctoolbox_ndvi_2014-07-08T09:00:00.000Z
[INFO] 12:13:24.309 [Thread-3] DEBUG o.n.m.r.c.AbstractRepository - Update thread started.
[INFO] Directory: /mnt/extra/jenkins/workspace/Moving-Code-Runtime-RELEASE/mc-runtime/src/test/resources/testpackages
[INFO] Update interval: 20000 milliseconds
[INFO] 12:13:24.310 [main] DEBUG o.n.m.r.processors.ProcessorFactory - Creating new processor for package: org.n52.movingcode.runtime.test.ztransform_2014-07-08T09:00:00.000Z
[INFO] 12:13:24.312 [main] INFO  o.n.m.r.test.MCRuntimeTestConfig - 
[INFO] Information for package: de.tu-dresden.geo.gis.algorithms.raster.ztransform
[INFO] Package Timestamp is: 2014-07-08T09:00:00.000Z
[INFO] --- Parameters ---
[INFO] Parameter 1: 0..1
[INFO] ServiceOutputID: ZTRANSFORM
[INFO] Internal Type: MEDIA
[INFO] Parameter 2: 1..1
[INFO] ServiceInputID: REFERENCE_RASTER
[INFO] Internal Type: MEDIA
[INFO] Parameter 3: 2..1000
[INFO] ServiceInputID: STATS_RASTER
[INFO] Internal Type: MEDIA
[INFO] 
[INFO] 12:13:24.312 [main] DEBUG o.n.m.r.c.AbstractRepository - Create RemoteFeedRepository from http://141.30.100.178/gpfeed2/gpfeed.xml
[INFO] 12:13:24.332 [main] DEBUG o.n.m.runtime.feed.CodePackageFeed - Loading Feed from sun.net.www.protocol.http.HttpURLConnection$HttpInputStream@28f3b248
[INFO] 12:13:24.334 [main] INFO  o.n.m.runtime.feed.CodePackageFeed - New Feed: GeoprocessingAlgorithms
[INFO] 12:13:24.429 [main] DEBUG o.n.m.r.c.AbstractRepository - Loading package for feed entry de.tu-dresden.geo.gis.algorithms.test.ndvi
[INFO] 12:13:24.498 [main] DEBUG o.n.m.r.c.AbstractRepository - Loading package for feed entry de.tu-dresden.geo.gis.algorithms.raster.ztransform
[INFO] 12:13:24.564 [main] DEBUG o.n.m.r.c.AbstractRepository - Loading package for feed entry de.tu-dresden.geo.gis.algorithms.test.echo
[INFO] 12:13:24.628 [main] DEBUG o.n.m.r.c.AbstractRepository - Loading package for feed entry de.tu-dresden.geo.gis.algorithms.test.echo
[INFO] 12:13:24.628 [main] INFO  o.n.m.r.test.MCRuntimeTestConfig - Added Repo: http://141.30.100.178/gpfeed2/gpfeed.xml
[INFO] 12:13:24.629 [main] DEBUG o.n.m.r.processors.ProcessorFactory - Could not find a suitable processor for package: org.n52.movingcode.runtime.test.arctoolbox_ndvi_2014-07-08T09:00:00.000Z
[INFO] 12:13:24.630 [main] DEBUG o.n.m.r.processors.ProcessorFactory - Creating new processor for package: org.n52.movingcode.runtime.test.ztransform_2014-07-08T09:00:00.000Z
[INFO] 12:13:24.632 [main] DEBUG o.n.m.r.processors.ProcessorFactory - Creating new processor for package: org.n52.movingcode.runtime.test.jar_copy_2014-07-08T09:00:00.000Z
[INFO] 12:13:24.633 [main] INFO  o.n.m.r.test.MCRuntimeTestConfig - 
[INFO] 
[INFO] Found process: org.n52.movingcode.runtime.test.arctoolbox_ndvi_2014-07-08T09:00:00.000Z
[INFO] Couldn't get a processor for package org.n52.movingcode.runtime.test.arctoolbox_ndvi_2014-07-08T09:00:00.000Z
[INFO] 
[INFO] Found process: org.n52.movingcode.runtime.test.ztransform_2014-07-08T09:00:00.000Z
[INFO] Compatible Processors: org.n52.movingcode.runtime.processors.python.PythonCLIProcessor
[INFO] --- Parameters ---
[INFO] Parameter 1: 0..1
[INFO] ServiceOutputID: ZTRANSFORM
[INFO] Internal Type: MEDIA
[INFO] Parameter 2: 1..1
[INFO] ServiceInputID: REFERENCE_RASTER
[INFO] Internal Type: MEDIA
[INFO] Parameter 3: 2..1000
[INFO] ServiceInputID: STATS_RASTER
[INFO] Internal Type: MEDIA
[INFO] 
[INFO] Found process: org.n52.movingcode.runtime.test.jar_copy_2014-07-08T09:00:00.000Z
[INFO] Compatible Processors: org.n52.movingcode.runtime.processors.java.JavaJARProcessor
[INFO] --- Parameters ---
[INFO] Parameter 1: 1..1
[INFO] ServiceInputID: CALL
[INFO] Internal Type: MEDIA
[INFO] Parameter 2: 0..1
[INFO] ServiceOutputID: RESPONSE
[INFO] Internal Type: MEDIA
[INFO] 
[INFO] 12:13:24.637 [main] INFO  o.n.m.r.c.AbstractRepository - Scanning directory: /tmp/ap21i2pe
[INFO] 12:13:24.638 [main] INFO  o.n.m.r.test.MCRuntimeTestConfig - Added Repo: http://141.30.100.178/gpfeed2/gpfeed.xml
[INFO] 12:13:24.638 [main] INFO  o.n.m.r.test.MCRuntimeTestConfig - Using Cache directory: /tmp/ap21i2pe
[INFO] 12:13:24.638 [main] INFO  o.n.m.r.test.MCRuntimeTestConfig - 
[INFO] 
[INFO] 12:13:24.638 [main] INFO  o.n.m.r.test.MCRuntimeTestConfig - /mnt/extra/jenkins/workspace/Moving-Code-Runtime-RELEASE/mc-runtime/src/test/resources/testpackages
[INFO] 12:13:24.639 [Thread-6] INFO  o.n.m.r.c.CachedRemoteFeedRepository - Loading remote repository from URL http://141.30.100.178/gpfeed2/gpfeed.xml
[INFO] 12:13:24.639 [Thread-6] DEBUG o.n.m.r.c.AbstractRepository - Create RemoteFeedRepository from http://141.30.100.178/gpfeed2/gpfeed.xml
[INFO] 12:13:24.639 [Thread-5] DEBUG o.n.m.r.c.AbstractRepository - Update thread started.
[INFO] Directory: /tmp/ap21i2pe
[INFO] Update interval: 20000 milliseconds
[INFO] 12:13:24.639 [main] INFO  o.n.m.r.c.AbstractRepository - Scanning directory: /mnt/extra/jenkins/workspace/Moving-Code-Runtime-RELEASE/mc-runtime/src/test/resources/testpackages
[INFO] 12:13:24.641 [main] INFO  o.n.m.r.c.AbstractRepository - Found package: /mnt/extra/jenkins/workspace/Moving-Code-Runtime-RELEASE/mc-runtime/src/test/resources/testpackages/jar_copy; using ID: org.n52.movingcode.runtime.test.jar_copy_2014-07-08T09:00:00.000Z
[INFO] 12:13:24.643 [main] INFO  o.n.m.r.c.AbstractRepository - Found package: /mnt/extra/jenkins/workspace/Moving-Code-Runtime-RELEASE/mc-runtime/src/test/resources/testpackages/py_copy; using ID: org.n52.movingcode.runtime.test.py_copy_2014-07-08T09:00:00.000Z
[INFO] 12:13:24.646 [main] INFO  o.n.m.r.c.AbstractRepository - Found package: /mnt/extra/jenkins/workspace/Moving-Code-Runtime-RELEASE/mc-runtime/src/test/resources/testpackages/py_geca; using ID: org.n52.movingcode.runtime.test.py_geca_2014-07-08T09:00:00.000Z
[INFO] 12:13:24.648 [main] INFO  o.n.m.r.c.AbstractRepository - Found package: /mnt/extra/jenkins/workspace/Moving-Code-Runtime-RELEASE/mc-runtime/src/test/resources/testpackages/ztransform; using ID: org.n52.movingcode.runtime.test.ztransform_2014-07-08T09:00:00.000Z
[INFO] 12:13:24.650 [main] INFO  o.n.m.r.c.AbstractRepository - Found package: /mnt/extra/jenkins/workspace/Moving-Code-Runtime-RELEASE/mc-runtime/src/test/resources/testpackages/arctoolbox_ndvi; using ID: org.n52.movingcode.runtime.test.arctoolbox_ndvi_2014-07-08T09:00:00.000Z
[INFO] 12:13:24.651 [main] INFO  o.n.m.r.test.MCRuntimeTestConfig - /tmp/tn6fne97/c7d0478k.zip
[INFO] 12:13:24.653 [Timer-2] DEBUG o.n.m.runtime.feed.CodePackageFeed - Loading Feed from sun.net.www.protocol.http.HttpURLConnection$HttpInputStream@447ad89c
[INFO] 12:13:24.655 [Timer-2] INFO  o.n.m.runtime.feed.CodePackageFeed - New Feed: GeoprocessingAlgorithms
[INFO] 12:13:24.655 [Timer-2] INFO  o.n.m.r.c.AbstractRepository - Reload finished.
[INFO] 12:13:24.659 [Thread-7] DEBUG o.n.m.r.c.AbstractRepository - Update thread started.
[INFO] Directory: /mnt/extra/jenkins/workspace/Moving-Code-Runtime-RELEASE/mc-runtime/src/test/resources/testpackages
[INFO] Update interval: 20000 milliseconds
[INFO] Tests run: 6, Failures: 0, Errors: 0, Skipped: 0, Time elapsed: 0.432 sec
[INFO] Running org.n52.movingcode.runtime.test.MimetypesTest
[INFO] 12:13:24.666 [main] INFO  o.n.m.r.test.MCRuntimeTestConfig - File for application/netcdf is: nc
[INFO] Tests run: 1, Failures: 0, Errors: 0, Skipped: 0, Time elapsed: 0 sec
[INFO] Running org.n52.movingcode.runtime.test.ExecutableJARTest
[INFO] 12:13:24.671 [main] DEBUG o.n.m.r.processors.ProcessorFactory - Creating new processor for package: org.n52.movingcode.runtime.test.jar_copy_2014-07-08T09:00:00.000Z
[INFO] 12:13:24.675 [main] DEBUG o.n.m.r.processors.ProcessorFactory - Creating new processor for package: org.n52.movingcode.runtime.test.jar_copy_2014-07-08T09:00:00.000Z
[INFO] 12:13:24.676 [Thread-6] DEBUG o.n.m.runtime.feed.CodePackageFeed - Loading Feed from sun.net.www.protocol.http.HttpURLConnection$HttpInputStream@2041e4d7
[INFO] 12:13:24.677 [Thread-6] INFO  o.n.m.runtime.feed.CodePackageFeed - New Feed: GeoprocessingAlgorithms
[INFO] 12:13:24.686 [main] DEBUG o.n.m.r.processors.ProcessorFactory - Creating new processor for package: org.n52.movingcode.runtime.test.jar_copy_2014-07-08T09:00:00.000Z
[INFO] 12:13:24.690 [main] INFO  o.n.m.r.test.MCRuntimeTestConfig - /mnt/extra/jenkins/workspace/Moving-Code-Runtime-RELEASE/mc-runtime/target/test-classes:/mnt/extra/jenkins/workspace/Moving-Code-Runtime-RELEASE/mc-runtime/target/classes:/var/data/maven-repository/junit/junit/4.10/junit-4.10.jar:/var/data/maven-repository/org/hamcrest/hamcrest-core/1.1/hamcrest-core-1.1.jar:/var/data/maven-repository/ch/qos/logback/logback-classic/1.0.13/logback-classic-1.0.13.jar:/var/data/maven-repository/ch/qos/logback/logback-core/1.0.13/logback-core-1.0.13.jar:/var/data/maven-repository/org/slf4j/slf4j-api/1.7.5/slf4j-api-1.7.5.jar:/var/data/maven-repository/org/apache/xmlbeans/xmlbeans/2.4.0/xmlbeans-2.4.0.jar:/var/data/maven-repository/stax/stax-api/1.0.1/stax-api-1.0.1.jar:/var/data/maven-repository/commons-io/commons-io/2.4/commons-io-2.4.jar:/var/data/maven-repository/org/apache/commons/commons-exec/1.3/commons-exec-1.3.jar:/var/data/maven-repository/com/google/guava/guava-collections/r03/guava-collections-r03.jar:/var/data/maven-repository/com/google/guava/guava-annotations/r03/guava-annotations-r03.jar:/var/data/maven-repository/com/google/guava/guava-primitives/r03/guava-primitives-r03.jar:/var/data/maven-repository/com/google/guava/guava-base/r03/guava-base-r03.jar:/var/data/maven-repository/org/apache/commons/commons-lang3/3.3.2/commons-lang3-3.3.2.jar:/var/data/maven-repository/org/apache/abdera/abdera-bundle/1.1.2/abdera-bundle-1.1.2.jar:/var/data/maven-repository/commons-codec/commons-codec/1.4/commons-codec-1.4.jar:/var/data/maven-repository/org/apache/geronimo/specs/geronimo-activation_1.0.2_spec/1.1/geronimo-activation_1.0.2_spec-1.1.jar:/var/data/maven-repository/org/apache/geronimo/specs/geronimo-stax-api_1.0_spec/1.0.1/geronimo-stax-api_1.0_spec-1.0.1.jar:/var/data/maven-repository/commons-logging/commons-logging/1.0.4/commons-logging-1.0.4.jar:/var/data/maven-repository/org/apache/ws/commons/axiom/axiom-impl/1.2.10/axiom-impl-1.2.10.jar:/var/data/maven-repository/org/apache/ws/commons/axiom/axiom-api/1.2.10/axiom-api-1.2.10.jar:/var/data/maven-repository/org/apache/geronimo/specs/geronimo-activation_1.1_spec/1.0.2/geronimo-activation_1.1_spec-1.0.2.jar:/var/data/maven-repository/org/apache/geronimo/specs/geronimo-javamail_1.4_spec/1.6/geronimo-javamail_1.4_spec-1.6.jar:/var/data/maven-repository/jaxen/jaxen/1.1.1/jaxen-1.1.1.jar:/var/data/maven-repository/org/codehaus/woodstox/wstx-asl/3.2.6/wstx-asl-3.2.6.jar:/var/data/maven-repository/xml-apis/xml-apis/1.3.04/xml-apis-1.3.04.jar:/var/data/maven-repository/xerces/xercesImpl/2.9.1/xercesImpl-2.9.1.jar:/var/data/maven-repository/commons-httpclient/commons-httpclient/3.1/commons-httpclient-3.1.jar:/var/data/maven-repository/javax/servlet/servlet-api/2.5/servlet-api-2.5.jar:/var/data/maven-repository/javax/mail/mail/1.4/mail-1.4.jar:/var/data/maven-repository/javax/activation/activation/1.1/activation-1.1.jar:/var/data/maven-repository/org/springframework/spring-web/2.0.6/spring-web-2.0.6.jar:/var/data/maven-repository/org/springframework/spring-beans/2.0.6/spring-beans-2.0.6.jar:/var/data/maven-repository/org/springframework/spring-core/2.0.6/spring-core-2.0.6.jar:/var/data/maven-repository/org/springframework/spring-context/2.0.6/spring-context-2.0.6.jar:/var/data/maven-repository/aopalliance/aopalliance/1.0/aopalliance-1.0.jar:/var/data/maven-repository/org/apache/jackrabbit/jackrabbit-core/1.4/jackrabbit-core-1.4.jar:/var/data/maven-repository/concurrent/concurrent/1.3.4/concurrent-1.3.4.jar:/var/data/maven-repository/commons-collections/commons-collections/3.1/commons-collections-3.1.jar:/var/data/maven-repository/org/apache/jackrabbit/jackrabbit-api/1.4/jackrabbit-api-1.4.jar:/var/data/maven-repository/org/apache/jackrabbit/jackrabbit-jcr-commons/1.4/jackrabbit-jcr-commons-1.4.jar:/var/data/maven-repository/org/apache/jackrabbit/jackrabbit-spi-commons/1.4/jackrabbit-spi-commons-1.4.jar:/var/data/maven-repository/org/apache/jackrabbit/jackrabbit-spi/1.4/jackrabbit-spi-1.4.jar:/var/data/maven-repository/org/apache/jackrabbit/jackrabbit-text-extractors/1.4/jackrabbit-text-extractors-1.4.jar:/var/data/maven-repository/org/apache/lucene/lucene-core/2.2.0/lucene-core-2.2.0.jar:/var/data/maven-repository/org/apache/derby/derby/10.2.1.6/derby-10.2.1.6.jar:/var/data/maven-repository/javax/jcr/jcr/1.0/jcr-1.0.jar:/var/data/maven-repository/org/apache/ibatis/ibatis-sqlmap/2.3.0/ibatis-sqlmap-2.3.0.jar:/var/data/maven-repository/xml-security/xmlsec/1.3.0/xmlsec-1.3.0.jar:/var/data/maven-repository/bouncycastle/bcprov-jdk15/124/bcprov-jdk15-124.jar:/var/data/maven-repository/xalan/xalan/2.7.0/xalan-2.7.0.jar:/var/data/maven-repository/nu/validator/htmlparser/htmlparser/1.0.5/htmlparser-1.0.5.jar:/var/data/maven-repository/net/sf/json-lib/json-lib/2.2.2/json-lib-2.2.2-jdk15.jar:/var/data/maven-repository/commons-beanutils/commons-beanutils/1.7.0/commons-beanutils-1.7.0.jar:/var/data/maven-repository/commons-lang/commons-lang/2.4/commons-lang-2.4.jar:/var/data/maven-repository/net/sf/ezmorph/ezmorph/1.0.4/ezmorph-1.0.4.jar:/var/data/maven-repository/org/rosuda/REngine/0.6-8/REngine-0.6-8.jar:/var/data/maven-repository/org/rosuda/RserveEngine/0.6-8/RserveEngine-0.6-8.jar:/var/data/maven-repository/com/fasterxml/jackson/core/jackson-core/2.3.3/jackson-core-2.3.3.jar:/var/data/maven-repository/com/fasterxml/jackson/core/jackson-databind/2.3.3/jackson-databind-2.3.3.jar:/var/data/maven-repository/com/fasterxml/jackson/core/jackson-annotations/2.3.3/jackson-annotations-2.3.3.jar:/var/data/maven-repository/joda-time/joda-time/2.3/joda-time-2.3.jar:/mnt/extra/jenkins/workspace/Moving-Code-Runtime-RELEASE/mc-schema/target/mc-schema-1.1.jar:/var/data/maven-repository/org/n52/wps/52n-xml-wps-v100/1.1.0/52n-xml-wps-v100-1.1.0.jar:/var/data/maven-repository/org/n52/sensorweb/52n-xml-ows-v110/1.1.0/52n-xml-ows-v110-1.1.0.jar:/var/data/maven-repository/org/n52/sensorweb/52n-xml-xlink-v110/1.0.0/52n-xml-xlink-v110-1.0.0.jar:
[INFO] Tests run: 4, Failures: 0, Errors: 0, Skipped: 0, Time elapsed: 0.024 sec
[INFO] Running org.n52.movingcode.runtime.test.FeedConversionTest
[INFO] 12:13:24.691 [main] DEBUG o.n.m.r.c.AbstractRepository - Create RemoteFeedRepository from http://141.30.100.178/gpfeed2/gpfeed.xml
[INFO] 12:13:24.711 [main] DEBUG o.n.m.runtime.feed.CodePackageFeed - Loading Feed from sun.net.www.protocol.http.HttpURLConnection$HttpInputStream@2c35e847
[INFO] 12:13:24.712 [main] INFO  o.n.m.runtime.feed.CodePackageFeed - New Feed: GeoprocessingAlgorithms
[INFO] 12:13:24.757 [Thread-6] DEBUG o.n.m.r.c.AbstractRepository - Loading package for feed entry de.tu-dresden.geo.gis.algorithms.test.ndvi
[INFO] 12:13:24.818 [Thread-6] DEBUG o.n.m.r.c.AbstractRepository - Loading package for feed entry de.tu-dresden.geo.gis.algorithms.raster.ztransform
[INFO] 12:13:24.839 [main] DEBUG o.n.m.r.c.AbstractRepository - Loading package for feed entry de.tu-dresden.geo.gis.algorithms.test.ndvi
[INFO] 12:13:24.881 [Thread-6] DEBUG o.n.m.r.c.AbstractRepository - Loading package for feed entry de.tu-dresden.geo.gis.algorithms.test.echo
[INFO] 12:13:24.903 [main] DEBUG o.n.m.r.c.AbstractRepository - Loading package for feed entry de.tu-dresden.geo.gis.algorithms.raster.ztransform
[INFO] 12:13:24.944 [Thread-6] DEBUG o.n.m.r.c.AbstractRepository - Loading package for feed entry de.tu-dresden.geo.gis.algorithms.test.echo
[INFO] 12:13:24.946 [Thread-6] INFO  o.n.m.r.c.CachedRemoteFeedRepository - Finished loading remote repository from URL http://141.30.100.178/gpfeed2/gpfeed.xml
[INFO] 12:13:24.964 [Timer-3] DEBUG o.n.m.runtime.feed.CodePackageFeed - Loading Feed from sun.net.www.protocol.http.HttpURLConnection$HttpInputStream@37bbe547
[INFO] 12:13:24.967 [Timer-3] INFO  o.n.m.runtime.feed.CodePackageFeed - New Feed: GeoprocessingAlgorithms
[INFO] 12:13:24.967 [Timer-3] INFO  o.n.m.r.c.AbstractRepository - Reload finished.
[INFO] 12:13:24.968 [main] DEBUG o.n.m.r.c.AbstractRepository - Loading package for feed entry de.tu-dresden.geo.gis.algorithms.test.echo
[INFO] 12:13:25.034 [main] DEBUG o.n.m.r.c.AbstractRepository - Loading package for feed entry de.tu-dresden.geo.gis.algorithms.test.echo
[INFO] 12:13:25.035 [main] INFO  o.n.m.r.test.MCRuntimeTestConfig - Added Repo: http://141.30.100.178/gpfeed2/gpfeed.xml
[INFO] 12:13:25.036 [main] INFO  o.n.m.r.test.MCRuntimeTestConfig - Using temp dir /tmp/eojep9ha
[INFO] Tests run: 1, Failures: 0, Errors: 0, Skipped: 0, Time elapsed: 0.345 sec
[INFO] Running org.n52.movingcode.runtime.test.IOParameterTest
[INFO] Tests run: 1, Failures: 0, Errors: 0, Skipped: 0, Time elapsed: 0.001 sec
[INFO] Running org.n52.movingcode.runtime.test.GeneralProcessorTest
[INFO] 12:13:25.040 [main] INFO  o.n.m.r.test.MCRuntimeTestConfig - 
[INFO] Processor found: org.n52.movingcode.runtime.processors.java.JavaJARProcessor
[INFO] Processor found: org.n52.movingcode.runtime.processors.python.PythonCLIProcessor
[INFO] 
[INFO] Tests run: 1, Failures: 0, Errors: 0, Skipped: 0, Time elapsed: 0.003 sec
[INFO] Running org.n52.movingcode.runtime.test.JSONConfigTest
[INFO] org.n52.movingcode.runtime.processors.java.JavaJARProcessor
[INFO] 	http://gis.geo.tu-dresden.de/movingcode/containerregistry/java-jar
[INFO] org.n52.movingcode.runtime.processors.python.PythonCLIProcessor
[INFO] 	http://gis.geo.tu-dresden.de/movingcode/containerregistry/pythonscript-2.5
[INFO] 
[INFO] Default Settings:
[INFO] C:/tmp
[INFO] 	http://gis.geo.tu-dresden.de/movingcode/platformregistry/component/gdal-1.8
[INFO] 	http://gis.geo.tu-dresden.de/movingcode/platformregistry/component/python-2.6
[INFO] 	http://gis.geo.tu-dresden.de/movingcode/platformregistry/component/python-2.7
[INFO] 	http://gis.geo.tu-dresden.de/movingcode/platformregistry/component/gdal-1.8-python-2.6
[INFO] 	http://gis.geo.tu-dresden.de/movingcode/platformregistry/component/arcgis-10.0
[INFO] 	http://gis.geo.tu-dresden.de/movingcode/platformregistry/component/arcgis-10.0-spatialanalyst
[INFO] 	http://gis.geo.tu-dresden.de/movingcode/platformregistry/platform/arcgis-10.0-analysis
[INFO] 	http://gis.geo.tu-dresden.de/movingcode/platformregistry/platform/java-1.6
[INFO] 	http://gis.geo.tu-dresden.de/movingcode/platformregistry/platform/java-1.7
[INFO] Tests run: 1, Failures: 0, Errors: 0, Skipped: 0, Time elapsed: 0 sec
[INFO] Running org.n52.movingcode.runtime.processors.AUIDTest
[INFO] 12:13:25.045 [main] INFO  o.n.m.r.test.MCRuntimeTestConfig - Genrating some AUIDs ...
[INFO] 12:13:25.049 [main] INFO  o.n.m.r.test.MCRuntimeTestConfig - 
[INFO] sbb11cph, dfn188ij, rh14d2il, j9h67b7j, ee4fi6d6, q5b6b88k, fa7p021l, ng70n4cl, ppkdfdl3, ei00lddd, 
[INFO] eg99njkf, o9ba54cb, uf5akk35, c1lnd3lp, wla8f5j5, gbg8g4fi, yb1abg7j, oe655823, gpm88a57, lhc4e1n8, 
[INFO] tl3kfk48, oigoicnm, t1j1n0k4, faj4ba58, g97aofic, d6blg0h9, rd8f4i3k, caiajp1b, xmge7aga, pceg08pf, 
[INFO] z8do1kao, bb916n2e, lah71cap, y2k9hjl0, zidbhfb7, zgpd2d09, hai67g2d, mhhm9p5h, uca810ni, x99b45mh, 
[INFO] kigd0429, abnkeck2, ag5k0cg6, jc3h4o88, a2e84d34, e15iabg6, b7pab7jd, xm10hjd1, odiee8hn, sodk5m7b, 
[INFO] ykemj09c, qi1gcmpo, nk0iap31, egf4bcah, r276je33, h9hi893c, n5ba4p2k, hakjg610, m7gogkl5, v6m2bppb, 
[INFO] bkc6c6lj, l5d6jkm1, k83b27k9, ll94hjd1, e5nfp7o3, ro6fo7bo, j5efhfbp, h08pmag5, ohejbjnj, d7nl3a0a, 
[INFO] bbi8cna6, f5nn468a, rfhbglim, mdddp88p, do6n3pb6, n8a5bm68, rnbff8c5, z8ehfoai, ypk03a20, mnc4g6ka, 
[INFO] xldl879i, f1aa1kck, f9blng6m, e49c3ph2, rdk69i2f, ii074fja, mj24ok0c, p9l15h50, fl9nmghg, pajikp84, 
[INFO] bm8m2hd2, bmp8ioce, tmmghn36, bli75p6i, t0hei2ec, hl4484g4, le84o848, r1kj80p9, gc3f81d5, j0oc2hl7, 
[INFO] 
[INFO] Tests run: 1, Failures: 0, Errors: 0, Skipped: 0, Time elapsed: 0.004 sec
[INFO] 
[INFO] Results :
[INFO] 
[INFO] Tests run: 19, Failures: 0, Errors: 0, Skipped: 0
[INFO] 
[INFO] [INFO] 
[INFO] [INFO] --- maven-jar-plugin:2.4:jar (default-jar) @ mc-runtime ---
[INFO] [INFO] Building jar: /mnt/extra/jenkins/workspace/Moving-Code-Runtime-RELEASE/mc-runtime/target/mc-runtime-1.1.jar
[INFO] [INFO]                                                                         
[INFO] [INFO] ------------------------------------------------------------------------
[INFO] [INFO] Building Code Package Feed 1.1
[INFO] [INFO] ------------------------------------------------------------------------
[INFO] [INFO] 
[INFO] [INFO] --- maven-clean-plugin:2.4.1:clean (default-clean) @ mc-feed ---
[INFO] [INFO] Deleting /mnt/extra/jenkins/workspace/Moving-Code-Runtime-RELEASE/mc-feed/target
[INFO] [INFO] 
[INFO] [INFO] --- license-maven-plugin:2.8:check (default) @ mc-feed ---
[INFO] [INFO] Checking licenses...
[INFO] [INFO] 
[INFO] [INFO] --- maven-resources-plugin:2.5:resources (default-resources) @ mc-feed ---
[INFO] [debug] execute contextualize
[INFO] [INFO] Using 'UTF-8' encoding to copy filtered resources.
[INFO] [INFO] Copying 1 resource
[INFO] [INFO] 
[INFO] [INFO] --- maven-compiler-plugin:2.5.1:compile (default-compile) @ mc-feed ---
[INFO] [INFO] Compiling 5 source files to /mnt/extra/jenkins/workspace/Moving-Code-Runtime-RELEASE/mc-feed/target/classes
[INFO] [INFO] 
[INFO] [INFO] --- maven-compiler-plugin:2.5.1:testCompile (test-compile) @ mc-feed ---
[INFO] [INFO] No sources to compile
[INFO] [INFO] 
[INFO] [INFO] --- maven-resources-plugin:2.5:testResources (default-testResources) @ mc-feed ---
[INFO] [debug] execute contextualize
[INFO] [INFO] Using 'UTF-8' encoding to copy filtered resources.
[INFO] [INFO] skip non existing resourceDirectory /mnt/extra/jenkins/workspace/Moving-Code-Runtime-RELEASE/mc-feed/src/test/resources
[INFO] [INFO] 
[INFO] [INFO] --- maven-compiler-plugin:2.5.1:testCompile (default-testCompile) @ mc-feed ---
[INFO] [INFO] No sources to compile
[INFO] [INFO] 
[INFO] [INFO] --- maven-surefire-plugin:2.12.4:test (default-test) @ mc-feed ---
[INFO] [INFO] Tests are skipped.
[INFO] [INFO] 
[INFO] [INFO] --- maven-war-plugin:2.4:war (default-war) @ mc-feed ---
[INFO] [INFO] Packaging webapp
[INFO] [INFO] Assembling webapp [mc-feed] in [/mnt/extra/jenkins/workspace/Moving-Code-Runtime-RELEASE/mc-feed/target/mc-feed]
[INFO] [INFO] Processing war project
[INFO] [INFO] Webapp assembled in [69 msecs]
[INFO] [INFO] Building war: /mnt/extra/jenkins/workspace/Moving-Code-Runtime-RELEASE/mc-feed/target/mc-feed.war
[INFO] [INFO] ------------------------------------------------------------------------
[INFO] [INFO] Reactor Summary:
[INFO] [INFO] 
[INFO] [INFO] Moving Code Framework ............................. SUCCESS [0.053s]
[INFO] [INFO] Moving Code XML Schema ............................ SUCCESS [2.750s]
[INFO] [INFO] Moving Code Runtime ............................... SUCCESS [6.470s]
[INFO] [INFO] Code Package Feed ................................. SUCCESS [1.206s]
[INFO] [INFO] ------------------------------------------------------------------------
[INFO] [INFO] BUILD SUCCESS
[INFO] [INFO] ------------------------------------------------------------------------
[INFO] [INFO] Total time: 10.810s
[INFO] [INFO] Finished at: Mon May 02 12:13:26 UTC 2016
[INFO] [INFO] Final Memory: 31M/318M
[INFO] [INFO] ------------------------------------------------------------------------
[INFO] Checking in modified POMs...
[INFO] Executing: /bin/sh -c cd /var/lib/jenkins/workspace/Moving-Code-Runtime-RELEASE && git add -- pom.xml mc-schema/pom.xml mc-runtime/pom.xml mc-feed/pom.xml
[INFO] Working directory: /var/lib/jenkins/workspace/Moving-Code-Runtime-RELEASE
[INFO] Executing: /bin/sh -c cd /var/lib/jenkins/workspace/Moving-Code-Runtime-RELEASE && git status
[INFO] Working directory: /var/lib/jenkins/workspace/Moving-Code-Runtime-RELEASE
[INFO] Executing: /bin/sh -c cd /var/lib/jenkins/workspace/Moving-Code-Runtime-RELEASE && git commit --verbose -F /tmp/maven-scm-871861033.commit pom.xml mc-schema/pom.xml mc-runtime/pom.xml mc-feed/pom.xml
[INFO] Working directory: /var/lib/jenkins/workspace/Moving-Code-Runtime-RELEASE
[INFO] Executing: /bin/sh -c cd /var/lib/jenkins/workspace/Moving-Code-Runtime-RELEASE && git symbolic-ref HEAD
[INFO] Working directory: /var/lib/jenkins/workspace/Moving-Code-Runtime-RELEASE
[INFO] Executing: /bin/sh -c cd /var/lib/jenkins/workspace/Moving-Code-Runtime-RELEASE && git push https://github.com/52North/movingcode.git master:master
[INFO] Working directory: /var/lib/jenkins/workspace/Moving-Code-Runtime-RELEASE
[INFO] ------------------------------------------------------------------------
[INFO] Reactor Summary:
[INFO] 
[INFO] Moving Code Framework ............................. FAILURE [13.409s]
[INFO] Moving Code XML Schema ............................ SKIPPED
[INFO] Moving Code Runtime ............................... SKIPPED
[INFO] Code Package Feed ................................. SKIPPED
[INFO] ------------------------------------------------------------------------
[INFO] BUILD FAILURE
[INFO] ------------------------------------------------------------------------
[INFO] Total time: 13.972s
[INFO] Finished at: Mon May 02 12:13:27 UTC 2016
[INFO] Final Memory: 12M/157M
[INFO] ------------------------------------------------------------------------
[ERROR] Failed to execute goal org.apache.maven.plugins:maven-release-plugin:2.1:prepare (default-cli) on project movingcode-parent: Unable to commit files
[ERROR] Provider message:
[ERROR] The git-push command failed.
[ERROR] Command output:
[ERROR] fatal: could not read Username for 'https://github.com': No such device or address
[ERROR] -> [Help 1]
[ERROR] 
[ERROR] To see the full stack trace of the errors, re-run Maven with the -e switch.
[ERROR] Re-run Maven using the -X switch to enable full debug logging.
[ERROR] 
[ERROR] For more information about the errors and possible solutions, please read the following articles:
[ERROR] [Help 1] http://cwiki.apache.org/confluence/display/MAVEN/MojoFailureException
[JENKINS] Archiving /var/lib/jenkins/workspace/Moving-Code-Runtime-RELEASE/mc-feed/pom.xml to org.n52.mc/mc-feed/1.1-SNAPSHOT/mc-feed-1.1-SNAPSHOT.pom
[JENKINS] Archiving /var/lib/jenkins/workspace/Moving-Code-Runtime-RELEASE/mc-schema/pom.xml to org.n52.mc/mc-schema/1.1-SNAPSHOT/mc-schema-1.1-SNAPSHOT.pom
[JENKINS] Archiving /var/lib/jenkins/workspace/Moving-Code-Runtime-RELEASE/mc-runtime/pom.xml to org.n52.mc/mc-runtime/1.1-SNAPSHOT/mc-runtime-1.1-SNAPSHOT.pom
[JENKINS] Archiving /var/lib/jenkins/workspace/Moving-Code-Runtime-RELEASE/pom.xml to org.n52.mc/movingcode-parent/1.1-SNAPSHOT/movingcode-parent-1.1-SNAPSHOT.pom
Sending e-mails to: b.pross@52north.org
channel stopped
Sending e-mails to: b.pross@52north.org
Finished: FAILURE