Console Output

Started by user BenjaminPross
Building in workspace /var/lib/jenkins/workspace/Moving-Code-Runtime-RELEASE
 > git rev-parse --is-inside-work-tree # timeout=10
Fetching changes from the remote Git repository
 > git config remote.origin.url ssh://git@github.com/52North/movingcode.git # timeout=10
Fetching upstream changes from ssh://git@github.com/52North/movingcode.git
 > git --version # timeout=10
 > git -c core.askpass=true fetch --tags --progress ssh://git@github.com/52North/movingcode.git +refs/heads/*:refs/remotes/origin/*
 > git rev-parse origin/master^{commit} # timeout=10
Checking out Revision a4152a3b02ab70e4a4095303efb9e526dd21c7c9 (origin/master)
 > git config core.sparsecheckout # timeout=10
 > git checkout -f a4152a3b02ab70e4a4095303efb9e526dd21c7c9 # timeout=10
 > git branch -a -v --no-abbrev # timeout=10
 > git branch -D master # timeout=10
 > git checkout -b master a4152a3b02ab70e4a4095303efb9e526dd21c7c9
 > git rev-list a4152a3b02ab70e4a4095303efb9e526dd21c7c9 # timeout=10
Parsing POMs
Modules changed, recalculating dependency graph
Established TCP socket on 57237
[Moving-Code-Runtime-RELEASE] $ java -Xmx1024m -XX:MaxPermSize=1024m -cp /var/lib/jenkins/plugins/maven-plugin/WEB-INF/lib/maven3-agent-1.7.jar:/var/lib/jenkins/tools/hudson.tasks.Maven_MavenInstallation/Maven_3.0.x/boot/plexus-classworlds-2.4.jar org.jvnet.hudson.maven3.agent.Maven3Main /var/lib/jenkins/tools/hudson.tasks.Maven_MavenInstallation/Maven_3.0.x /var/cache/jenkins/war/WEB-INF/lib/remoting-2.56.jar /var/lib/jenkins/plugins/maven-plugin/WEB-INF/lib/maven3-interceptor-1.7.jar /var/lib/jenkins/plugins/maven-plugin/WEB-INF/lib/maven3-interceptor-commons-1.7.jar 57237
Java HotSpot(TM) 64-Bit Server VM warning: ignoring option MaxPermSize=1024m; support was removed in 8.0
<===[JENKINS REMOTING CAPACITY]===>channel started
Executing Maven:  -B -f /var/lib/jenkins/workspace/Moving-Code-Runtime-RELEASE/pom.xml -DdevelopmentVersion=1.2-SNAPSHOT -DreleaseVersion=1.1 -Dresume=false release:prepare release:perform -Denv=release
[INFO] Scanning for projects...
[INFO] ------------------------------------------------------------------------
[INFO] Reactor Build Order:
[INFO] 
[INFO] Moving Code Framework
[INFO] Moving Code XML Schema
[INFO] Moving Code Runtime
[INFO] Code Package Feed
[INFO]                                                                         
[INFO] ------------------------------------------------------------------------
[INFO] Building Moving Code Framework 1.1-SNAPSHOT
[INFO] ------------------------------------------------------------------------
[INFO] 
[INFO] --- maven-release-plugin:2.1:prepare (default-cli) @ movingcode-parent ---
[INFO] Verifying that there are no local modifications...
[INFO]   ignoring changes on: pom.xml.next, pom.xml.releaseBackup, pom.xml.tag, pom.xml.backup, pom.xml.branch, release.properties
[INFO] Executing: /bin/sh -c cd /var/lib/jenkins/workspace/Moving-Code-Runtime-RELEASE && git status
[INFO] Working directory: /var/lib/jenkins/workspace/Moving-Code-Runtime-RELEASE
[INFO] Checking dependencies and plugins for snapshots ...
[INFO] Transforming 'Moving Code Framework'...
[INFO] Updating mc-runtime to 1.1
[INFO] Ignoring artifact version update for expression: ${project.version}
[INFO] Updating mc-schema to 1.1
[INFO] Ignoring artifact version update for expression: ${project.version}
[INFO] Transforming 'Moving Code XML Schema'...
[INFO] Transforming 'Moving Code Runtime'...
[INFO] Updating mc-schema to 1.1
[INFO] Transforming 'Code Package Feed'...
[INFO] Updating mc-runtime to 1.1
[INFO] Not generating release POMs
[INFO] Executing goals 'clean verify'...
[INFO] Java HotSpot(TM) 64-Bit Server VM warning: ignoring option MaxPermSize=1024m; support was removed in 8.0
[INFO] [INFO] Scanning for projects...
[INFO] [INFO] ------------------------------------------------------------------------
[INFO] [INFO] Reactor Build Order:
[INFO] [INFO] 
[INFO] [INFO] Moving Code Framework
[INFO] [INFO] Moving Code XML Schema
[INFO] [INFO] Moving Code Runtime
[INFO] [INFO] Code Package Feed
[INFO] [INFO]                                                                         
[INFO] [INFO] ------------------------------------------------------------------------
[INFO] [INFO] Building Moving Code Framework 1.1
[INFO] [INFO] ------------------------------------------------------------------------
[INFO] [INFO] 
[INFO] [INFO] --- maven-clean-plugin:2.4.1:clean (default-clean) @ movingcode-parent ---
[INFO] [INFO]                                                                         
[INFO] [INFO] ------------------------------------------------------------------------
[INFO] [INFO] Building Moving Code XML Schema 1.1
[INFO] [INFO] ------------------------------------------------------------------------
[INFO] [INFO] 
[INFO] [INFO] --- maven-clean-plugin:2.4.1:clean (default-clean) @ mc-schema ---
[INFO] [INFO] Deleting /mnt/extra/jenkins/workspace/Moving-Code-Runtime-RELEASE/mc-schema/target
[INFO] [INFO] 
[INFO] [INFO] --- xmlbeans-maven-plugin:2.3.3:xmlbeans (default) @ mc-schema ---
[INFO] [INFO] 
[INFO] [INFO] --- maven-resources-plugin:2.5:resources (default-resources) @ mc-schema ---
[INFO] [debug] execute contextualize
[INFO] [INFO] Using 'UTF-8' encoding to copy filtered resources.
[INFO] [INFO] skip non existing resourceDirectory /mnt/extra/jenkins/workspace/Moving-Code-Runtime-RELEASE/mc-schema/src/main/resources
[INFO] [INFO] Copying 252 resources
[INFO] [INFO] 
[INFO] [INFO] --- maven-compiler-plugin:2.5.1:compile (default-compile) @ mc-schema ---
[INFO] [INFO] Nothing to compile - all classes are up to date
[INFO] [INFO] 
[INFO] [INFO] --- maven-resources-plugin:2.5:testResources (default-testResources) @ mc-schema ---
[INFO] [debug] execute contextualize
[INFO] [INFO] Using 'UTF-8' encoding to copy filtered resources.
[INFO] [INFO] skip non existing resourceDirectory /mnt/extra/jenkins/workspace/Moving-Code-Runtime-RELEASE/mc-schema/src/test/resources
[INFO] [INFO] 
[INFO] [INFO] --- maven-compiler-plugin:2.5.1:testCompile (default-testCompile) @ mc-schema ---
[INFO] [INFO] No sources to compile
[INFO] [INFO] 
[INFO] [INFO] --- maven-surefire-plugin:2.12.4:test (default-test) @ mc-schema ---
[INFO] [INFO] Tests are skipped.
[INFO] [INFO] 
[INFO] [INFO] --- maven-jar-plugin:2.4:jar (default-jar) @ mc-schema ---
[INFO] [INFO] Building jar: /mnt/extra/jenkins/workspace/Moving-Code-Runtime-RELEASE/mc-schema/target/mc-schema-1.1.jar
[INFO] [INFO]                                                                         
[INFO] [INFO] ------------------------------------------------------------------------
[INFO] [INFO] Building Moving Code Runtime 1.1
[INFO] [INFO] ------------------------------------------------------------------------
[INFO] [INFO] 
[INFO] [INFO] --- maven-clean-plugin:2.4.1:clean (default-clean) @ mc-runtime ---
[INFO] [INFO] Deleting /mnt/extra/jenkins/workspace/Moving-Code-Runtime-RELEASE/mc-runtime/target
[INFO] [INFO] 
[INFO] [INFO] --- license-maven-plugin:2.8:check (default) @ mc-runtime ---
[INFO] [INFO] Checking licenses...
[INFO] [INFO] 
[INFO] [INFO] --- maven-resources-plugin:2.5:resources (default-resources) @ mc-runtime ---
[INFO] [debug] execute contextualize
[INFO] [INFO] Using 'UTF-8' encoding to copy filtered resources.
[INFO] [INFO] Copying 6 resources
[INFO] [INFO] 
[INFO] [INFO] --- maven-compiler-plugin:2.5.1:compile (default-compile) @ mc-runtime ---
[INFO] [INFO] Compiling 53 source files to /mnt/extra/jenkins/workspace/Moving-Code-Runtime-RELEASE/mc-runtime/target/classes
[INFO] [INFO] 
[INFO] [INFO] --- maven-compiler-plugin:2.5.1:testCompile (test-compile) @ mc-runtime ---
[INFO] [INFO] Compiling 17 source files to /mnt/extra/jenkins/workspace/Moving-Code-Runtime-RELEASE/mc-runtime/target/test-classes
[INFO] [INFO] 
[INFO] [INFO] --- maven-resources-plugin:2.5:testResources (default-testResources) @ mc-runtime ---
[INFO] [debug] execute contextualize
[INFO] [INFO] Using 'UTF-8' encoding to copy filtered resources.
[INFO] [INFO] Copying 27 resources
[INFO] [INFO] 
[INFO] [INFO] --- maven-compiler-plugin:2.5.1:testCompile (default-testCompile) @ mc-runtime ---
[INFO] [INFO] Nothing to compile - all classes are up to date
[INFO] [INFO] 
[INFO] [INFO] --- maven-surefire-plugin:2.12.4:test (default-test) @ mc-runtime ---
[INFO] [INFO] Surefire report directory: /mnt/extra/jenkins/workspace/Moving-Code-Runtime-RELEASE/mc-runtime/target/surefire-reports
[INFO] 
[INFO] -------------------------------------------------------
[INFO]  T E S T S
[INFO] -------------------------------------------------------
[INFO] Running org.n52.movingcode.runtime.test.ValidatePackageTest
[INFO] 12:03:03.888 [main] INFO  o.n.m.r.test.MCRuntimeTestConfig - /mnt/extra/jenkins/workspace/Moving-Code-Runtime-RELEASE/mc-runtime/src/test/resources/testpackages/ztransform.zip
[INFO] Tests run: 2, Failures: 0, Errors: 0, Skipped: 0, Time elapsed: 0.39 sec
[INFO] Running org.n52.movingcode.runtime.test.FeedReadTest
[INFO] 12:03:03.912 [main] DEBUG o.n.m.r.c.AbstractRepository - Create RemoteFeedRepository from http://141.30.100.178/gpfeed2/gpfeed.xml
[INFO] 12:03:03.966 [main] DEBUG o.n.m.runtime.feed.CodePackageFeed - Loading Feed from sun.net.www.protocol.http.HttpURLConnection$HttpInputStream@657c8ad9
[INFO] 12:03:04.141 [main] INFO  o.n.m.runtime.feed.CodePackageFeed - New Feed: GeoprocessingAlgorithms
[INFO] 12:03:04.289 [main] DEBUG o.n.m.r.c.AbstractRepository - Loading package for feed entry de.tu-dresden.geo.gis.algorithms.test.ndvi
[INFO] 12:03:04.374 [main] DEBUG o.n.m.r.c.AbstractRepository - Loading package for feed entry de.tu-dresden.geo.gis.algorithms.raster.ztransform
[INFO] 12:03:04.449 [main] DEBUG o.n.m.r.c.AbstractRepository - Loading package for feed entry de.tu-dresden.geo.gis.algorithms.test.echo
[INFO] 12:03:04.524 [main] DEBUG o.n.m.r.c.AbstractRepository - Loading package for feed entry de.tu-dresden.geo.gis.algorithms.test.echo
[INFO] 12:03:04.534 [main] INFO  o.n.m.r.test.MCRuntimeTestConfig - Added Repo: http://141.30.100.178/gpfeed2/gpfeed.xml
[INFO] 12:03:04.554 [Timer-0] DEBUG o.n.m.runtime.feed.CodePackageFeed - Loading Feed from sun.net.www.protocol.http.HttpURLConnection$HttpInputStream@3fca8b32
[INFO] 12:03:04.555 [Timer-0] INFO  o.n.m.runtime.feed.CodePackageFeed - New Feed: GeoprocessingAlgorithms
[INFO] 12:03:04.556 [Timer-0] INFO  o.n.m.r.c.AbstractRepository - Reload finished.
[INFO] 12:03:04.567 [main] DEBUG o.n.m.r.processors.ProcessorFactory - Could not find a suitable processor for package: org.n52.movingcode.runtime.test.arctoolbox_ndvi_2014-07-08T09:00:00.000Z
[INFO] 12:03:04.568 [main] DEBUG o.n.m.r.processors.ProcessorFactory - Creating new processor for package: org.n52.movingcode.runtime.test.ztransform_2014-07-08T09:00:00.000Z
[INFO] 12:03:04.590 [main] DEBUG o.n.m.r.processors.ProcessorFactory - Creating new processor for package: org.n52.movingcode.runtime.test.jar_copy_2014-07-08T09:00:00.000Z
[INFO] 12:03:04.593 [main] INFO  o.n.m.r.test.MCRuntimeTestConfig - 
[INFO] 
[INFO] Found process: org.n52.movingcode.runtime.test.arctoolbox_ndvi_2014-07-08T09:00:00.000Z
[INFO] Couldn't get a processor for package org.n52.movingcode.runtime.test.arctoolbox_ndvi_2014-07-08T09:00:00.000Z
[INFO] 
[INFO] Found process: org.n52.movingcode.runtime.test.ztransform_2014-07-08T09:00:00.000Z
[INFO] Compatible Processors: org.n52.movingcode.runtime.processors.python.PythonCLIProcessor
[INFO] --- Parameters ---
[INFO] Parameter 1: 0..1
[INFO] ServiceOutputID: ZTRANSFORM
[INFO] Internal Type: MEDIA
[INFO] Parameter 2: 1..1
[INFO] ServiceInputID: REFERENCE_RASTER
[INFO] Internal Type: MEDIA
[INFO] Parameter 3: 2..1000
[INFO] ServiceInputID: STATS_RASTER
[INFO] Internal Type: MEDIA
[INFO] 
[INFO] Found process: org.n52.movingcode.runtime.test.jar_copy_2014-07-08T09:00:00.000Z
[INFO] Compatible Processors: org.n52.movingcode.runtime.processors.java.JavaJARProcessor
[INFO] --- Parameters ---
[INFO] Parameter 1: 1..1
[INFO] ServiceInputID: CALL
[INFO] Internal Type: MEDIA
[INFO] Parameter 2: 0..1
[INFO] ServiceOutputID: RESPONSE
[INFO] Internal Type: MEDIA
[INFO] 
[INFO] Tests run: 1, Failures: 0, Errors: 0, Skipped: 0, Time elapsed: 0.687 sec
[INFO] Running org.n52.movingcode.runtime.test.MovingCodeRepositoryTests
[INFO] 12:03:04.595 [main] INFO  o.n.m.r.test.MCRuntimeTestConfig - /mnt/extra/jenkins/workspace/Moving-Code-Runtime-RELEASE/mc-runtime/src/test/resources/testpackages
[INFO] 12:03:04.606 [main] INFO  o.n.m.r.c.AbstractRepository - Scanning directory: /mnt/extra/jenkins/workspace/Moving-Code-Runtime-RELEASE/mc-runtime/src/test/resources/testpackages
[INFO] 12:03:04.606 [main] DEBUG o.n.m.r.c.AbstractRepository - Found package: src/test/resources/testpackages/ztransform.zip
[INFO] 12:03:04.611 [main] DEBUG o.n.m.r.c.AbstractRepository - Registered package: src/test/resources/testpackages/ztransform.zip; using ID: org.n52.movingcode.runtime.test.ztransform_2014-07-08T09:00:00.000Z
[INFO] 12:03:04.611 [main] DEBUG o.n.m.r.c.AbstractRepository - Found package: src/test/resources/testpackages/py_copy.zip
[INFO] 12:03:04.616 [main] DEBUG o.n.m.r.c.AbstractRepository - Registered package: src/test/resources/testpackages/py_copy.zip; using ID: org.n52.movingcode.runtime.test.py_copy_2014-07-08T09:00:00.000Z
[INFO] 12:03:04.616 [main] DEBUG o.n.m.r.c.AbstractRepository - Found package: src/test/resources/testpackages/py_geca.zip
[INFO] 12:03:04.628 [main] DEBUG o.n.m.r.c.AbstractRepository - Registered package: src/test/resources/testpackages/py_geca.zip; using ID: org.n52.movingcode.runtime.test.py_geca_2014-07-08T09:00:00.000Z
[INFO] 12:03:04.629 [main] DEBUG o.n.m.r.c.AbstractRepository - Found package: src/test/resources/testpackages/arctoolbox_ndvi.zip
[INFO] 12:03:04.635 [main] DEBUG o.n.m.r.c.AbstractRepository - Registered package: src/test/resources/testpackages/arctoolbox_ndvi.zip; using ID: org.n52.movingcode.runtime.test.arctoolbox_ndvi_2014-07-08T09:00:00.000Z
[INFO] 12:03:04.635 [main] DEBUG o.n.m.r.c.AbstractRepository - Found package: src/test/resources/testpackages/jar_copy.zip
[INFO] 12:03:04.639 [main] DEBUG o.n.m.r.c.AbstractRepository - Registered package: src/test/resources/testpackages/jar_copy.zip; using ID: org.n52.movingcode.runtime.test.jar_copy_2014-07-08T09:00:00.000Z
[INFO] 12:03:04.640 [main] DEBUG o.n.m.r.test.MCRuntimeTestConfig - Retrieving process: de.tu-dresden.geo.gis.algorithms.raster.ztransform
[INFO] 12:03:04.644 [main] DEBUG o.n.m.r.test.MCRuntimeTestConfig - Found package: org.n52.movingcode.runtime.test.ztransform_2014-07-08T09:00:00.000Z supplying process de.tu-dresden.geo.gis.algorithms.raster.ztransform
[INFO] 12:03:04.645 [main] DEBUG o.n.m.r.processors.ProcessorFactory - Creating new processor for package: org.n52.movingcode.runtime.test.ztransform_2014-07-08T09:00:00.000Z
[INFO] 12:03:04.648 [main] INFO  o.n.m.r.test.MCRuntimeTestConfig - 
[INFO] --- Parameters ---
[INFO] Parameter 1: 0..1
[INFO] ServiceOutputID: ZTRANSFORM
[INFO] Internal Type: MEDIA
[INFO] Parameter 2: 1..1
[INFO] ServiceInputID: REFERENCE_RASTER
[INFO] Internal Type: MEDIA
[INFO] Parameter 3: 2..1000
[INFO] ServiceInputID: STATS_RASTER
[INFO] Internal Type: MEDIA
[INFO] 
[INFO] 12:03:04.649 [main] INFO  o.n.m.r.test.MCRuntimeTestConfig - Adding plain folder repo: /mnt/extra/jenkins/workspace/Moving-Code-Runtime-RELEASE/mc-runtime/src/test/resources/testpackages
[INFO] 12:03:04.656 [main] INFO  o.n.m.r.c.AbstractRepository - Scanning directory: /mnt/extra/jenkins/workspace/Moving-Code-Runtime-RELEASE/mc-runtime/src/test/resources/testpackages
[INFO] 12:03:04.660 [main] INFO  o.n.m.r.c.AbstractRepository - Found package: /mnt/extra/jenkins/workspace/Moving-Code-Runtime-RELEASE/mc-runtime/src/test/resources/testpackages/jar_copy; using ID: org.n52.movingcode.runtime.test.jar_copy_2014-07-08T09:00:00.000Z
[INFO] 12:03:04.664 [main] INFO  o.n.m.r.c.AbstractRepository - Found package: /mnt/extra/jenkins/workspace/Moving-Code-Runtime-RELEASE/mc-runtime/src/test/resources/testpackages/py_copy; using ID: org.n52.movingcode.runtime.test.py_copy_2014-07-08T09:00:00.000Z
[INFO] 12:03:04.668 [main] INFO  o.n.m.r.c.AbstractRepository - Found package: /mnt/extra/jenkins/workspace/Moving-Code-Runtime-RELEASE/mc-runtime/src/test/resources/testpackages/py_geca; using ID: org.n52.movingcode.runtime.test.py_geca_2014-07-08T09:00:00.000Z
[INFO] 12:03:04.671 [main] INFO  o.n.m.r.c.AbstractRepository - Found package: /mnt/extra/jenkins/workspace/Moving-Code-Runtime-RELEASE/mc-runtime/src/test/resources/testpackages/ztransform; using ID: org.n52.movingcode.runtime.test.ztransform_2014-07-08T09:00:00.000Z
[INFO] 12:03:04.674 [main] INFO  o.n.m.r.c.AbstractRepository - Found package: /mnt/extra/jenkins/workspace/Moving-Code-Runtime-RELEASE/mc-runtime/src/test/resources/testpackages/arctoolbox_ndvi; using ID: org.n52.movingcode.runtime.test.arctoolbox_ndvi_2014-07-08T09:00:00.000Z
[INFO] 12:03:04.676 [main] DEBUG o.n.m.r.processors.ProcessorFactory - Creating new processor for package: org.n52.movingcode.runtime.test.ztransform_2014-07-08T09:00:00.000Z
[INFO] 12:03:04.678 [main] INFO  o.n.m.r.test.MCRuntimeTestConfig - 
[INFO] Information for package: de.tu-dresden.geo.gis.algorithms.raster.ztransform
[INFO] Package Timestamp is: 2014-07-08T09:00:00.000Z
[INFO] --- Parameters ---
[INFO] Parameter 1: 0..1
[INFO] ServiceOutputID: ZTRANSFORM
[INFO] Internal Type: MEDIA
[INFO] Parameter 2: 1..1
[INFO] ServiceInputID: REFERENCE_RASTER
[INFO] Internal Type: MEDIA
[INFO] Parameter 3: 2..1000
[INFO] ServiceInputID: STATS_RASTER
[INFO] Internal Type: MEDIA
[INFO] 
[INFO] 12:03:04.679 [Thread-3] DEBUG o.n.m.r.c.AbstractRepository - Update thread started.
[INFO] Directory: /mnt/extra/jenkins/workspace/Moving-Code-Runtime-RELEASE/mc-runtime/src/test/resources/testpackages
[INFO] Update interval: 20000 milliseconds
[INFO] 12:03:04.681 [main] DEBUG o.n.m.r.c.AbstractRepository - Create RemoteFeedRepository from http://141.30.100.178/gpfeed2/gpfeed.xml
[INFO] 12:03:04.701 [main] DEBUG o.n.m.runtime.feed.CodePackageFeed - Loading Feed from sun.net.www.protocol.http.HttpURLConnection$HttpInputStream@32b260fa
[INFO] 12:03:04.703 [main] INFO  o.n.m.runtime.feed.CodePackageFeed - New Feed: GeoprocessingAlgorithms
[INFO] 12:03:04.779 [main] DEBUG o.n.m.r.c.AbstractRepository - Loading package for feed entry de.tu-dresden.geo.gis.algorithms.test.ndvi
[INFO] 12:03:04.851 [main] DEBUG o.n.m.r.c.AbstractRepository - Loading package for feed entry de.tu-dresden.geo.gis.algorithms.raster.ztransform
[INFO] 12:03:04.918 [main] DEBUG o.n.m.r.c.AbstractRepository - Loading package for feed entry de.tu-dresden.geo.gis.algorithms.test.echo
[INFO] 12:03:04.985 [main] DEBUG o.n.m.r.c.AbstractRepository - Loading package for feed entry de.tu-dresden.geo.gis.algorithms.test.echo
[INFO] 12:03:04.986 [main] INFO  o.n.m.r.test.MCRuntimeTestConfig - Added Repo: http://141.30.100.178/gpfeed2/gpfeed.xml
[INFO] 12:03:04.988 [main] DEBUG o.n.m.r.processors.ProcessorFactory - Could not find a suitable processor for package: org.n52.movingcode.runtime.test.arctoolbox_ndvi_2014-07-08T09:00:00.000Z
[INFO] 12:03:04.989 [main] DEBUG o.n.m.r.processors.ProcessorFactory - Creating new processor for package: org.n52.movingcode.runtime.test.ztransform_2014-07-08T09:00:00.000Z
[INFO] 12:03:04.994 [main] DEBUG o.n.m.r.processors.ProcessorFactory - Creating new processor for package: org.n52.movingcode.runtime.test.jar_copy_2014-07-08T09:00:00.000Z
[INFO] 12:03:04.997 [main] INFO  o.n.m.r.test.MCRuntimeTestConfig - 
[INFO] 
[INFO] Found process: org.n52.movingcode.runtime.test.arctoolbox_ndvi_2014-07-08T09:00:00.000Z
[INFO] Couldn't get a processor for package org.n52.movingcode.runtime.test.arctoolbox_ndvi_2014-07-08T09:00:00.000Z
[INFO] 
[INFO] Found process: org.n52.movingcode.runtime.test.ztransform_2014-07-08T09:00:00.000Z
[INFO] Compatible Processors: org.n52.movingcode.runtime.processors.python.PythonCLIProcessor
[INFO] --- Parameters ---
[INFO] Parameter 1: 0..1
[INFO] ServiceOutputID: ZTRANSFORM
[INFO] Internal Type: MEDIA
[INFO] Parameter 2: 1..1
[INFO] ServiceInputID: REFERENCE_RASTER
[INFO] Internal Type: MEDIA
[INFO] Parameter 3: 2..1000
[INFO] ServiceInputID: STATS_RASTER
[INFO] Internal Type: MEDIA
[INFO] 
[INFO] Found process: org.n52.movingcode.runtime.test.jar_copy_2014-07-08T09:00:00.000Z
[INFO] Compatible Processors: org.n52.movingcode.runtime.processors.java.JavaJARProcessor
[INFO] --- Parameters ---
[INFO] Parameter 1: 1..1
[INFO] ServiceInputID: CALL
[INFO] Internal Type: MEDIA
[INFO] Parameter 2: 0..1
[INFO] ServiceOutputID: RESPONSE
[INFO] Internal Type: MEDIA
[INFO] 
[INFO] 12:03:05.001 [main] INFO  o.n.m.r.c.AbstractRepository - Scanning directory: /tmp/d81ndcn6
[INFO] 12:03:05.001 [Thread-5] DEBUG o.n.m.r.c.AbstractRepository - Update thread started.
[INFO] Directory: /tmp/d81ndcn6
[INFO] Update interval: 20000 milliseconds
[INFO] 12:03:05.002 [main] INFO  o.n.m.r.test.MCRuntimeTestConfig - Added Repo: http://141.30.100.178/gpfeed2/gpfeed.xml
[INFO] 12:03:05.002 [main] INFO  o.n.m.r.test.MCRuntimeTestConfig - Using Cache directory: /tmp/d81ndcn6
[INFO] 12:03:05.002 [main] INFO  o.n.m.r.test.MCRuntimeTestConfig - 
[INFO] 
[INFO] 12:03:05.002 [main] INFO  o.n.m.r.test.MCRuntimeTestConfig - /mnt/extra/jenkins/workspace/Moving-Code-Runtime-RELEASE/mc-runtime/src/test/resources/testpackages
[INFO] 12:03:05.003 [Thread-6] INFO  o.n.m.r.c.CachedRemoteFeedRepository - Loading remote repository from URL http://141.30.100.178/gpfeed2/gpfeed.xml
[INFO] 12:03:05.003 [main] INFO  o.n.m.r.c.AbstractRepository - Scanning directory: /mnt/extra/jenkins/workspace/Moving-Code-Runtime-RELEASE/mc-runtime/src/test/resources/testpackages
[INFO] 12:03:05.003 [Thread-6] DEBUG o.n.m.r.c.AbstractRepository - Create RemoteFeedRepository from http://141.30.100.178/gpfeed2/gpfeed.xml
[INFO] 12:03:05.005 [main] INFO  o.n.m.r.c.AbstractRepository - Found package: /mnt/extra/jenkins/workspace/Moving-Code-Runtime-RELEASE/mc-runtime/src/test/resources/testpackages/jar_copy; using ID: org.n52.movingcode.runtime.test.jar_copy_2014-07-08T09:00:00.000Z
[INFO] 12:03:05.007 [Timer-2] DEBUG o.n.m.runtime.feed.CodePackageFeed - Loading Feed from sun.net.www.protocol.http.HttpURLConnection$HttpInputStream@447ad89c
[INFO] 12:03:05.007 [main] INFO  o.n.m.r.c.AbstractRepository - Found package: /mnt/extra/jenkins/workspace/Moving-Code-Runtime-RELEASE/mc-runtime/src/test/resources/testpackages/py_copy; using ID: org.n52.movingcode.runtime.test.py_copy_2014-07-08T09:00:00.000Z
[INFO] 12:03:05.008 [Timer-2] INFO  o.n.m.runtime.feed.CodePackageFeed - New Feed: GeoprocessingAlgorithms
[INFO] 12:03:05.009 [Timer-2] INFO  o.n.m.r.c.AbstractRepository - Reload finished.
[INFO] 12:03:05.010 [main] INFO  o.n.m.r.c.AbstractRepository - Found package: /mnt/extra/jenkins/workspace/Moving-Code-Runtime-RELEASE/mc-runtime/src/test/resources/testpackages/py_geca; using ID: org.n52.movingcode.runtime.test.py_geca_2014-07-08T09:00:00.000Z
[INFO] 12:03:05.013 [main] INFO  o.n.m.r.c.AbstractRepository - Found package: /mnt/extra/jenkins/workspace/Moving-Code-Runtime-RELEASE/mc-runtime/src/test/resources/testpackages/ztransform; using ID: org.n52.movingcode.runtime.test.ztransform_2014-07-08T09:00:00.000Z
[INFO] 12:03:05.015 [main] INFO  o.n.m.r.c.AbstractRepository - Found package: /mnt/extra/jenkins/workspace/Moving-Code-Runtime-RELEASE/mc-runtime/src/test/resources/testpackages/arctoolbox_ndvi; using ID: org.n52.movingcode.runtime.test.arctoolbox_ndvi_2014-07-08T09:00:00.000Z
[INFO] 12:03:05.016 [main] INFO  o.n.m.r.test.MCRuntimeTestConfig - /tmp/zmi4hja4/vko7eh2m.zip
[INFO] 12:03:05.021 [Thread-7] DEBUG o.n.m.r.c.AbstractRepository - Update thread started.
[INFO] Directory: /mnt/extra/jenkins/workspace/Moving-Code-Runtime-RELEASE/mc-runtime/src/test/resources/testpackages
[INFO] Update interval: 20000 milliseconds
[INFO] Tests run: 6, Failures: 0, Errors: 0, Skipped: 0, Time elapsed: 0.435 sec
[INFO] Running org.n52.movingcode.runtime.test.MimetypesTest
[INFO] 12:03:05.032 [main] INFO  o.n.m.r.test.MCRuntimeTestConfig - File for application/netcdf is: nc
[INFO] Tests run: 1, Failures: 0, Errors: 0, Skipped: 0, Time elapsed: 0.001 sec
[INFO] Running org.n52.movingcode.runtime.test.ExecutableJARTest
[INFO] 12:03:05.037 [main] DEBUG o.n.m.r.processors.ProcessorFactory - Creating new processor for package: org.n52.movingcode.runtime.test.jar_copy_2014-07-08T09:00:00.000Z
[INFO] 12:03:05.041 [main] DEBUG o.n.m.r.processors.ProcessorFactory - Creating new processor for package: org.n52.movingcode.runtime.test.jar_copy_2014-07-08T09:00:00.000Z
[INFO] 12:03:05.043 [Thread-6] DEBUG o.n.m.runtime.feed.CodePackageFeed - Loading Feed from sun.net.www.protocol.http.HttpURLConnection$HttpInputStream@2041e4d7
[INFO] 12:03:05.044 [Thread-6] INFO  o.n.m.runtime.feed.CodePackageFeed - New Feed: GeoprocessingAlgorithms
[INFO] 12:03:05.061 [main] DEBUG o.n.m.r.processors.ProcessorFactory - Creating new processor for package: org.n52.movingcode.runtime.test.jar_copy_2014-07-08T09:00:00.000Z
[INFO] 12:03:05.066 [main] INFO  o.n.m.r.test.MCRuntimeTestConfig - /mnt/extra/jenkins/workspace/Moving-Code-Runtime-RELEASE/mc-runtime/target/test-classes:/mnt/extra/jenkins/workspace/Moving-Code-Runtime-RELEASE/mc-runtime/target/classes:/var/data/maven-repository/junit/junit/4.10/junit-4.10.jar:/var/data/maven-repository/org/hamcrest/hamcrest-core/1.1/hamcrest-core-1.1.jar:/var/data/maven-repository/ch/qos/logback/logback-classic/1.0.13/logback-classic-1.0.13.jar:/var/data/maven-repository/ch/qos/logback/logback-core/1.0.13/logback-core-1.0.13.jar:/var/data/maven-repository/org/slf4j/slf4j-api/1.7.5/slf4j-api-1.7.5.jar:/var/data/maven-repository/org/apache/xmlbeans/xmlbeans/2.4.0/xmlbeans-2.4.0.jar:/var/data/maven-repository/stax/stax-api/1.0.1/stax-api-1.0.1.jar:/var/data/maven-repository/commons-io/commons-io/2.4/commons-io-2.4.jar:/var/data/maven-repository/org/apache/commons/commons-exec/1.3/commons-exec-1.3.jar:/var/data/maven-repository/com/google/guava/guava-collections/r03/guava-collections-r03.jar:/var/data/maven-repository/com/google/guava/guava-annotations/r03/guava-annotations-r03.jar:/var/data/maven-repository/com/google/guava/guava-primitives/r03/guava-primitives-r03.jar:/var/data/maven-repository/com/google/guava/guava-base/r03/guava-base-r03.jar:/var/data/maven-repository/org/apache/commons/commons-lang3/3.3.2/commons-lang3-3.3.2.jar:/var/data/maven-repository/org/apache/abdera/abdera-bundle/1.1.2/abdera-bundle-1.1.2.jar:/var/data/maven-repository/commons-codec/commons-codec/1.4/commons-codec-1.4.jar:/var/data/maven-repository/org/apache/geronimo/specs/geronimo-activation_1.0.2_spec/1.1/geronimo-activation_1.0.2_spec-1.1.jar:/var/data/maven-repository/org/apache/geronimo/specs/geronimo-stax-api_1.0_spec/1.0.1/geronimo-stax-api_1.0_spec-1.0.1.jar:/var/data/maven-repository/commons-logging/commons-logging/1.0.4/commons-logging-1.0.4.jar:/var/data/maven-repository/org/apache/ws/commons/axiom/axiom-impl/1.2.10/axiom-impl-1.2.10.jar:/var/data/maven-repository/org/apache/ws/commons/axiom/axiom-api/1.2.10/axiom-api-1.2.10.jar:/var/data/maven-repository/org/apache/geronimo/specs/geronimo-activation_1.1_spec/1.0.2/geronimo-activation_1.1_spec-1.0.2.jar:/var/data/maven-repository/org/apache/geronimo/specs/geronimo-javamail_1.4_spec/1.6/geronimo-javamail_1.4_spec-1.6.jar:/var/data/maven-repository/jaxen/jaxen/1.1.1/jaxen-1.1.1.jar:/var/data/maven-repository/org/codehaus/woodstox/wstx-asl/3.2.6/wstx-asl-3.2.6.jar:/var/data/maven-repository/xml-apis/xml-apis/1.3.04/xml-apis-1.3.04.jar:/var/data/maven-repository/xerces/xercesImpl/2.9.1/xercesImpl-2.9.1.jar:/var/data/maven-repository/commons-httpclient/commons-httpclient/3.1/commons-httpclient-3.1.jar:/var/data/maven-repository/javax/servlet/servlet-api/2.5/servlet-api-2.5.jar:/var/data/maven-repository/javax/mail/mail/1.4/mail-1.4.jar:/var/data/maven-repository/javax/activation/activation/1.1/activation-1.1.jar:/var/data/maven-repository/org/springframework/spring-web/2.0.6/spring-web-2.0.6.jar:/var/data/maven-repository/org/springframework/spring-beans/2.0.6/spring-beans-2.0.6.jar:/var/data/maven-repository/org/springframework/spring-core/2.0.6/spring-core-2.0.6.jar:/var/data/maven-repository/org/springframework/spring-context/2.0.6/spring-context-2.0.6.jar:/var/data/maven-repository/aopalliance/aopalliance/1.0/aopalliance-1.0.jar:/var/data/maven-repository/org/apache/jackrabbit/jackrabbit-core/1.4/jackrabbit-core-1.4.jar:/var/data/maven-repository/concurrent/concurrent/1.3.4/concurrent-1.3.4.jar:/var/data/maven-repository/commons-collections/commons-collections/3.1/commons-collections-3.1.jar:/var/data/maven-repository/org/apache/jackrabbit/jackrabbit-api/1.4/jackrabbit-api-1.4.jar:/var/data/maven-repository/org/apache/jackrabbit/jackrabbit-jcr-commons/1.4/jackrabbit-jcr-commons-1.4.jar:/var/data/maven-repository/org/apache/jackrabbit/jackrabbit-spi-commons/1.4/jackrabbit-spi-commons-1.4.jar:/var/data/maven-repository/org/apache/jackrabbit/jackrabbit-spi/1.4/jackrabbit-spi-1.4.jar:/var/data/maven-repository/org/apache/jackrabbit/jackrabbit-text-extractors/1.4/jackrabbit-text-extractors-1.4.jar:/var/data/maven-repository/org/apache/lucene/lucene-core/2.2.0/lucene-core-2.2.0.jar:/var/data/maven-repository/org/apache/derby/derby/10.2.1.6/derby-10.2.1.6.jar:/var/data/maven-repository/javax/jcr/jcr/1.0/jcr-1.0.jar:/var/data/maven-repository/org/apache/ibatis/ibatis-sqlmap/2.3.0/ibatis-sqlmap-2.3.0.jar:/var/data/maven-repository/xml-security/xmlsec/1.3.0/xmlsec-1.3.0.jar:/var/data/maven-repository/bouncycastle/bcprov-jdk15/124/bcprov-jdk15-124.jar:/var/data/maven-repository/xalan/xalan/2.7.0/xalan-2.7.0.jar:/var/data/maven-repository/nu/validator/htmlparser/htmlparser/1.0.5/htmlparser-1.0.5.jar:/var/data/maven-repository/net/sf/json-lib/json-lib/2.2.2/json-lib-2.2.2-jdk15.jar:/var/data/maven-repository/commons-beanutils/commons-beanutils/1.7.0/commons-beanutils-1.7.0.jar:/var/data/maven-repository/commons-lang/commons-lang/2.4/commons-lang-2.4.jar:/var/data/maven-repository/net/sf/ezmorph/ezmorph/1.0.4/ezmorph-1.0.4.jar:/var/data/maven-repository/org/rosuda/REngine/0.6-8/REngine-0.6-8.jar:/var/data/maven-repository/org/rosuda/RserveEngine/0.6-8/RserveEngine-0.6-8.jar:/var/data/maven-repository/com/fasterxml/jackson/core/jackson-core/2.3.3/jackson-core-2.3.3.jar:/var/data/maven-repository/com/fasterxml/jackson/core/jackson-databind/2.3.3/jackson-databind-2.3.3.jar:/var/data/maven-repository/com/fasterxml/jackson/core/jackson-annotations/2.3.3/jackson-annotations-2.3.3.jar:/var/data/maven-repository/joda-time/joda-time/2.3/joda-time-2.3.jar:/mnt/extra/jenkins/workspace/Moving-Code-Runtime-RELEASE/mc-schema/target/mc-schema-1.1.jar:/var/data/maven-repository/org/n52/wps/52n-xml-wps-v100/1.1.0/52n-xml-wps-v100-1.1.0.jar:/var/data/maven-repository/org/n52/sensorweb/52n-xml-ows-v110/1.1.0/52n-xml-ows-v110-1.1.0.jar:/var/data/maven-repository/org/n52/sensorweb/52n-xml-xlink-v110/1.0.0/52n-xml-xlink-v110-1.0.0.jar:
[INFO] Tests run: 4, Failures: 0, Errors: 0, Skipped: 0, Time elapsed: 0.034 sec
[INFO] Running org.n52.movingcode.runtime.test.FeedConversionTest
[INFO] 12:03:05.069 [main] DEBUG o.n.m.r.c.AbstractRepository - Create RemoteFeedRepository from http://141.30.100.178/gpfeed2/gpfeed.xml
[INFO] 12:03:05.088 [main] DEBUG o.n.m.runtime.feed.CodePackageFeed - Loading Feed from sun.net.www.protocol.http.HttpURLConnection$HttpInputStream@21e360a
[INFO] 12:03:05.090 [main] INFO  o.n.m.runtime.feed.CodePackageFeed - New Feed: GeoprocessingAlgorithms
[INFO] 12:03:05.129 [Thread-6] DEBUG o.n.m.r.c.AbstractRepository - Loading package for feed entry de.tu-dresden.geo.gis.algorithms.test.ndvi
[INFO] 12:03:05.196 [Thread-6] DEBUG o.n.m.r.c.AbstractRepository - Loading package for feed entry de.tu-dresden.geo.gis.algorithms.raster.ztransform
[INFO] 12:03:05.200 [main] DEBUG o.n.m.r.c.AbstractRepository - Loading package for feed entry de.tu-dresden.geo.gis.algorithms.test.ndvi
[INFO] 12:03:05.264 [Thread-6] DEBUG o.n.m.r.c.AbstractRepository - Loading package for feed entry de.tu-dresden.geo.gis.algorithms.test.echo
[INFO] 12:03:05.266 [main] DEBUG o.n.m.r.c.AbstractRepository - Loading package for feed entry de.tu-dresden.geo.gis.algorithms.raster.ztransform
[INFO] 12:03:05.332 [Thread-6] DEBUG o.n.m.r.c.AbstractRepository - Loading package for feed entry de.tu-dresden.geo.gis.algorithms.test.echo
[INFO] 12:03:05.333 [main] DEBUG o.n.m.r.c.AbstractRepository - Loading package for feed entry de.tu-dresden.geo.gis.algorithms.test.echo
[INFO] 12:03:05.333 [Thread-6] INFO  o.n.m.r.c.CachedRemoteFeedRepository - Finished loading remote repository from URL http://141.30.100.178/gpfeed2/gpfeed.xml
[INFO] 12:03:05.352 [Timer-3] DEBUG o.n.m.runtime.feed.CodePackageFeed - Loading Feed from sun.net.www.protocol.http.HttpURLConnection$HttpInputStream@37bbe547
[INFO] 12:03:05.354 [Timer-3] INFO  o.n.m.runtime.feed.CodePackageFeed - New Feed: GeoprocessingAlgorithms
[INFO] 12:03:05.354 [Timer-3] INFO  o.n.m.r.c.AbstractRepository - Reload finished.
[INFO] 12:03:05.399 [main] DEBUG o.n.m.r.c.AbstractRepository - Loading package for feed entry de.tu-dresden.geo.gis.algorithms.test.echo
[INFO] 12:03:05.400 [main] INFO  o.n.m.r.test.MCRuntimeTestConfig - Added Repo: http://141.30.100.178/gpfeed2/gpfeed.xml
[INFO] 12:03:05.400 [main] INFO  o.n.m.r.test.MCRuntimeTestConfig - Using temp dir /tmp/f494d091
[INFO] Tests run: 1, Failures: 0, Errors: 0, Skipped: 0, Time elapsed: 0.333 sec
[INFO] Running org.n52.movingcode.runtime.test.IOParameterTest
[INFO] Tests run: 1, Failures: 0, Errors: 0, Skipped: 0, Time elapsed: 0.001 sec
[INFO] Running org.n52.movingcode.runtime.test.GeneralProcessorTest
[INFO] 12:03:05.404 [main] INFO  o.n.m.r.test.MCRuntimeTestConfig - 
[INFO] Processor found: org.n52.movingcode.runtime.processors.java.JavaJARProcessor
[INFO] Processor found: org.n52.movingcode.runtime.processors.python.PythonCLIProcessor
[INFO] 
[INFO] Tests run: 1, Failures: 0, Errors: 0, Skipped: 0, Time elapsed: 0.001 sec
[INFO] Running org.n52.movingcode.runtime.test.JSONConfigTest
[INFO] org.n52.movingcode.runtime.processors.java.JavaJARProcessor
[INFO] 	http://gis.geo.tu-dresden.de/movingcode/containerregistry/java-jar
[INFO] org.n52.movingcode.runtime.processors.python.PythonCLIProcessor
[INFO] 	http://gis.geo.tu-dresden.de/movingcode/containerregistry/pythonscript-2.5
[INFO] 
[INFO] Default Settings:
[INFO] C:/tmp
[INFO] 	http://gis.geo.tu-dresden.de/movingcode/platformregistry/component/gdal-1.8
[INFO] 	http://gis.geo.tu-dresden.de/movingcode/platformregistry/component/python-2.6
[INFO] 	http://gis.geo.tu-dresden.de/movingcode/platformregistry/component/python-2.7
[INFO] 	http://gis.geo.tu-dresden.de/movingcode/platformregistry/component/gdal-1.8-python-2.6
[INFO] 	http://gis.geo.tu-dresden.de/movingcode/platformregistry/component/arcgis-10.0
[INFO] 	http://gis.geo.tu-dresden.de/movingcode/platformregistry/component/arcgis-10.0-spatialanalyst
[INFO] 	http://gis.geo.tu-dresden.de/movingcode/platformregistry/platform/arcgis-10.0-analysis
[INFO] 	http://gis.geo.tu-dresden.de/movingcode/platformregistry/platform/java-1.6
[INFO] 	http://gis.geo.tu-dresden.de/movingcode/platformregistry/platform/java-1.7
[INFO] Tests run: 1, Failures: 0, Errors: 0, Skipped: 0, Time elapsed: 0.001 sec
[INFO] Running org.n52.movingcode.runtime.processors.AUIDTest
[INFO] 12:03:05.408 [main] INFO  o.n.m.r.test.MCRuntimeTestConfig - Genrating some AUIDs ...
[INFO] 12:03:05.414 [main] INFO  o.n.m.r.test.MCRuntimeTestConfig - 
[INFO] n5gh3a47, l16g2nij, vkl94n2j, fmf136fc, o26ma94o, eff1ca8k, k69m1oae, ljp6fnef, ujpg82i4, gji5jl5d, 
[INFO] hhi89enb, a6po8h97, m7bnfh9k, ypp2ie99, af48m5i5, lm7jn6e3, gf9ihdb2, w0f7ckc8, qn0b0eh8, t4n827gm, 
[INFO] o5iona6f, tgdmbn9e, cpnk6cf6, v3ok6kn4, w00h50ji, cle47018, ihk0m6ee, s7ic9694, d60eekah, o9ip69l8, 
[INFO] po2hh283, umpj5564, tj4i4co9, rebb0gf6, ej6a8496, ikb3olab, rn22k5h4, hp5448l5, t064jekb, znf35g1l, 
[INFO] thj8dndk, hh92meap, n82jmpaj, i8pajbcj, qd72jdin, g3flcb8l, t64gg75h, kef3j54o, o08gb42d, d302dlbo, 
[INFO] d9jj203c, keigfd22, wa9nhig3, w31k2lfg, ufbgk2le, y00g2bkb, g3lbkcfp, moinde4n, y0o4e78d, bfkkji8d, 
[INFO] eg73lbk9, opkoi8m5, f412b0af, el2nl5o2, c63n88cf, qjf98b6f, ho7ko91o, c5ip48p4, p1eeane2, gj93djh5, 
[INFO] yb2o660j, j6cfo350, gd13ink3, ccfg0a2f, a71l6527, v7anjmh8, oac4dg8l, n2pnlfkm, z5k757f3, cmonh166, 
[INFO] rfd0nl83, s9e5ih6l, zkimn548, gbgf7db3, elfi8oe0, b73abb9c, mcdf1905, hche49bb, wlkp30d4, p1ma66a6, 
[INFO] badn2c79, d31apo6m, gmnjk7kg, ehpl8kfd, xj4njb51, fh7fh36a, g898kn73, sp44od2f, i08lil46, rpdcpeo7, 
[INFO] 
[INFO] Tests run: 1, Failures: 0, Errors: 0, Skipped: 0, Time elapsed: 0.004 sec
[INFO] 
[INFO] Results :
[INFO] 
[INFO] Tests run: 19, Failures: 0, Errors: 0, Skipped: 0
[INFO] 
[INFO] [INFO] 
[INFO] [INFO] --- maven-jar-plugin:2.4:jar (default-jar) @ mc-runtime ---
[INFO] [INFO] Building jar: /mnt/extra/jenkins/workspace/Moving-Code-Runtime-RELEASE/mc-runtime/target/mc-runtime-1.1.jar
[INFO] [INFO]                                                                         
[INFO] [INFO] ------------------------------------------------------------------------
[INFO] [INFO] Building Code Package Feed 1.1
[INFO] [INFO] ------------------------------------------------------------------------
[INFO] [INFO] 
[INFO] [INFO] --- maven-clean-plugin:2.4.1:clean (default-clean) @ mc-feed ---
[INFO] [INFO] Deleting /mnt/extra/jenkins/workspace/Moving-Code-Runtime-RELEASE/mc-feed/target
[INFO] [INFO] 
[INFO] [INFO] --- license-maven-plugin:2.8:check (default) @ mc-feed ---
[INFO] [INFO] Checking licenses...
[INFO] [INFO] 
[INFO] [INFO] --- maven-resources-plugin:2.5:resources (default-resources) @ mc-feed ---
[INFO] [debug] execute contextualize
[INFO] [INFO] Using 'UTF-8' encoding to copy filtered resources.
[INFO] [INFO] Copying 1 resource
[INFO] [INFO] 
[INFO] [INFO] --- maven-compiler-plugin:2.5.1:compile (default-compile) @ mc-feed ---
[INFO] [INFO] Compiling 5 source files to /mnt/extra/jenkins/workspace/Moving-Code-Runtime-RELEASE/mc-feed/target/classes
[INFO] [INFO] 
[INFO] [INFO] --- maven-compiler-plugin:2.5.1:testCompile (test-compile) @ mc-feed ---
[INFO] [INFO] No sources to compile
[INFO] [INFO] 
[INFO] [INFO] --- maven-resources-plugin:2.5:testResources (default-testResources) @ mc-feed ---
[INFO] [debug] execute contextualize
[INFO] [INFO] Using 'UTF-8' encoding to copy filtered resources.
[INFO] [INFO] skip non existing resourceDirectory /mnt/extra/jenkins/workspace/Moving-Code-Runtime-RELEASE/mc-feed/src/test/resources
[INFO] [INFO] 
[INFO] [INFO] --- maven-compiler-plugin:2.5.1:testCompile (default-testCompile) @ mc-feed ---
[INFO] [INFO] No sources to compile
[INFO] [INFO] 
[INFO] [INFO] --- maven-surefire-plugin:2.12.4:test (default-test) @ mc-feed ---
[INFO] [INFO] Tests are skipped.
[INFO] [INFO] 
[INFO] [INFO] --- maven-war-plugin:2.4:war (default-war) @ mc-feed ---
[INFO] [INFO] Packaging webapp
[INFO] [INFO] Assembling webapp [mc-feed] in [/mnt/extra/jenkins/workspace/Moving-Code-Runtime-RELEASE/mc-feed/target/mc-feed]
[INFO] [INFO] Processing war project
[INFO] [INFO] Webapp assembled in [68 msecs]
[INFO] [INFO] Building war: /mnt/extra/jenkins/workspace/Moving-Code-Runtime-RELEASE/mc-feed/target/mc-feed.war
[INFO] [INFO] ------------------------------------------------------------------------
[INFO] [INFO] Reactor Summary:
[INFO] [INFO] 
[INFO] [INFO] Moving Code Framework ............................. SUCCESS [0.056s]
[INFO] [INFO] Moving Code XML Schema ............................ SUCCESS [2.773s]
[INFO] [INFO] Moving Code Runtime ............................... SUCCESS [4.287s]
[INFO] [INFO] Code Package Feed ................................. SUCCESS [1.226s]
[INFO] [INFO] ------------------------------------------------------------------------
[INFO] [INFO] BUILD SUCCESS
[INFO] [INFO] ------------------------------------------------------------------------
[INFO] [INFO] Total time: 8.676s
[INFO] [INFO] Finished at: Mon May 02 12:03:07 UTC 2016
[INFO] [INFO] Final Memory: 31M/334M
[INFO] [INFO] ------------------------------------------------------------------------
[INFO] Checking in modified POMs...
[INFO] Executing: /bin/sh -c cd /var/lib/jenkins/workspace/Moving-Code-Runtime-RELEASE && git add -- pom.xml mc-schema/pom.xml mc-runtime/pom.xml mc-feed/pom.xml
[INFO] Working directory: /var/lib/jenkins/workspace/Moving-Code-Runtime-RELEASE
[INFO] Executing: /bin/sh -c cd /var/lib/jenkins/workspace/Moving-Code-Runtime-RELEASE && git status
[INFO] Working directory: /var/lib/jenkins/workspace/Moving-Code-Runtime-RELEASE
[INFO] Executing: /bin/sh -c cd /var/lib/jenkins/workspace/Moving-Code-Runtime-RELEASE && git commit --verbose -F /tmp/maven-scm-198720668.commit pom.xml mc-schema/pom.xml mc-runtime/pom.xml mc-feed/pom.xml
[INFO] Working directory: /var/lib/jenkins/workspace/Moving-Code-Runtime-RELEASE
[INFO] Executing: /bin/sh -c cd /var/lib/jenkins/workspace/Moving-Code-Runtime-RELEASE && git symbolic-ref HEAD
[INFO] Working directory: /var/lib/jenkins/workspace/Moving-Code-Runtime-RELEASE
[INFO] Executing: /bin/sh -c cd /var/lib/jenkins/workspace/Moving-Code-Runtime-RELEASE && git push https://github.com/52North/movingcode.git master:master
[INFO] Working directory: /var/lib/jenkins/workspace/Moving-Code-Runtime-RELEASE
[INFO] ------------------------------------------------------------------------
[INFO] Reactor Summary:
[INFO] 
[INFO] Moving Code Framework ............................. FAILURE [11.275s]
[INFO] Moving Code XML Schema ............................ SKIPPED
[INFO] Moving Code Runtime ............................... SKIPPED
[INFO] Code Package Feed ................................. SKIPPED
[INFO] ------------------------------------------------------------------------
[INFO] BUILD FAILURE
[INFO] ------------------------------------------------------------------------
[INFO] Total time: 11.898s
[INFO] Finished at: Mon May 02 12:03:08 UTC 2016
[INFO] Final Memory: 12M/155M
[INFO] ------------------------------------------------------------------------
Waiting for Jenkins to finish collecting data
[ERROR] Failed to execute goal org.apache.maven.plugins:maven-release-plugin:2.1:prepare (default-cli) on project movingcode-parent: Unable to commit files
[ERROR] Provider message:
[ERROR] The git-push command failed.
[ERROR] Command output:
[ERROR] fatal: could not read Username for 'https://github.com': No such device or address
[ERROR] -> [Help 1]
[ERROR] 
[ERROR] To see the full stack trace of the errors, re-run Maven with the -e switch.
[ERROR] Re-run Maven using the -X switch to enable full debug logging.
[ERROR] 
[ERROR] For more information about the errors and possible solutions, please read the following articles:
[ERROR] [Help 1] http://cwiki.apache.org/confluence/display/MAVEN/MojoFailureException
[JENKINS] Archiving /var/lib/jenkins/workspace/Moving-Code-Runtime-RELEASE/mc-feed/pom.xml to org.n52.mc/mc-feed/1.1-SNAPSHOT/mc-feed-1.1-SNAPSHOT.pom
[JENKINS] Archiving /var/lib/jenkins/workspace/Moving-Code-Runtime-RELEASE/mc-schema/pom.xml to org.n52.mc/mc-schema/1.1-SNAPSHOT/mc-schema-1.1-SNAPSHOT.pom
[JENKINS] Archiving /var/lib/jenkins/workspace/Moving-Code-Runtime-RELEASE/mc-runtime/pom.xml to org.n52.mc/mc-runtime/1.1-SNAPSHOT/mc-runtime-1.1-SNAPSHOT.pom
[JENKINS] Archiving /var/lib/jenkins/workspace/Moving-Code-Runtime-RELEASE/pom.xml to org.n52.mc/movingcode-parent/1.1-SNAPSHOT/movingcode-parent-1.1-SNAPSHOT.pom
Sending e-mails to: b.pross@52north.org
channel stopped
Sending e-mails to: b.pross@52north.org
Finished: FAILURE