Console Output

Started by user BenjaminPross
Building in workspace /var/lib/jenkins/workspace/Geoprocessing-site
Updating https://svn.52north.org/svn/geoprocessing/main/52n-geoprocessing-site/trunk at revision '2014-07-14T10:18:01.967 +0200'
U         src/site/resources/script/read-blog.js
At revision 3378
Parsing POMs
[Geoprocessing-site] $ java -Xmx1024m -XX:MaxPermSize=1024m -cp /var/lib/jenkins/plugins/maven-plugin/WEB-INF/lib/maven31-agent-1.5.jar:/var/lib/jenkins/tools/hudson.tasks.Maven_MavenInstallation/Maven_3.0.x/boot/plexus-classworlds-2.5.1.jar:/var/lib/jenkins/tools/hudson.tasks.Maven_MavenInstallation/Maven_3.0.x/conf/logging jenkins.maven3.agent.Maven31Main /var/lib/jenkins/tools/hudson.tasks.Maven_MavenInstallation/Maven_3.0.x /var/cache/jenkins/war/WEB-INF/lib/remoting-2.43.jar /var/lib/jenkins/plugins/maven-plugin/WEB-INF/lib/maven31-interceptor-1.5.jar /var/lib/jenkins/plugins/maven-plugin/WEB-INF/lib/maven3-interceptor-commons-1.5.jar 57407
<===[JENKINS REMOTING CAPACITY]===>channel started
Executing Maven:  -B -f /var/lib/jenkins/workspace/Geoprocessing-site/pom.xml site:site
[INFO] Scanning for projects...
[INFO] 
[INFO] Using the builder org.apache.maven.lifecycle.internal.builder.singlethreaded.SingleThreadedBuilder with a thread count of 1
[INFO]                                                                         
[INFO] ------------------------------------------------------------------------
[INFO] Building 52north geoprocessing site 2.0.2
[INFO] ------------------------------------------------------------------------
[INFO] 
[INFO] --- maven-site-plugin:3.0:site (default-cli) @ 52n-geoprocessing-site ---
[WARNING] Error injecting: org.apache.maven.reporting.exec.DefaultMavenReportExecutor
java.lang.NoClassDefFoundError: org/sonatype/aether/graph/DependencyFilter
	at java.lang.Class.getDeclaredConstructors0(Native Method)
	at java.lang.Class.privateGetDeclaredConstructors(Class.java:2389)
	at java.lang.Class.getDeclaredConstructors(Class.java:1836)
	at com.google.inject.spi.InjectionPoint.forConstructorOf(InjectionPoint.java:245)
	at com.google.inject.internal.ConstructorBindingImpl.create(ConstructorBindingImpl.java:99)
	at com.google.inject.internal.InjectorImpl.createUninitializedBinding(InjectorImpl.java:653)
	at com.google.inject.internal.InjectorImpl.createJustInTimeBinding(InjectorImpl.java:863)
	at com.google.inject.internal.InjectorImpl.createJustInTimeBindingRecursive(InjectorImpl.java:790)
	at com.google.inject.internal.InjectorImpl.getJustInTimeBinding(InjectorImpl.java:278)
	at com.google.inject.internal.InjectorImpl.getBindingOrThrow(InjectorImpl.java:210)
	at com.google.inject.internal.InjectorImpl.getProviderOrThrow(InjectorImpl.java:986)
	at com.google.inject.internal.InjectorImpl.getProvider(InjectorImpl.java:1019)
	at com.google.inject.internal.InjectorImpl.getProvider(InjectorImpl.java:982)
	at com.google.inject.internal.InjectorImpl.getInstance(InjectorImpl.java:1032)
	at org.eclipse.sisu.space.AbstractDeferredClass.get(AbstractDeferredClass.java:48)
	at com.google.inject.internal.ProviderInternalFactory.provision(ProviderInternalFactory.java:86)
	at com.google.inject.internal.InternalFactoryToInitializableAdapter.provision(InternalFactoryToInitializableAdapter.java:55)
	at com.google.inject.internal.ProviderInternalFactory$1.call(ProviderInternalFactory.java:70)
	at com.google.inject.internal.ProvisionListenerStackCallback$Provision.provision(ProvisionListenerStackCallback.java:100)
	at org.eclipse.sisu.plexus.PlexusLifecycleManager.onProvision(PlexusLifecycleManager.java:133)
	at com.google.inject.internal.ProvisionListenerStackCallback$Provision.provision(ProvisionListenerStackCallback.java:109)
	at com.google.inject.internal.ProvisionListenerStackCallback.provision(ProvisionListenerStackCallback.java:55)
	at com.google.inject.internal.ProviderInternalFactory.circularGet(ProviderInternalFactory.java:68)
	at com.google.inject.internal.InternalFactoryToInitializableAdapter.get(InternalFactoryToInitializableAdapter.java:47)
	at com.google.inject.internal.ProviderToInternalFactoryAdapter$1.call(ProviderToInternalFactoryAdapter.java:46)
	at com.google.inject.internal.InjectorImpl.callInContext(InjectorImpl.java:1054)
	at com.google.inject.internal.ProviderToInternalFactoryAdapter.get(ProviderToInternalFactoryAdapter.java:40)
	at com.google.inject.Scopes$1$1.get(Scopes.java:59)
	at com.google.inject.internal.InternalFactoryToProviderAdapter.get(InternalFactoryToProviderAdapter.java:41)
	at com.google.inject.internal.InjectorImpl$2$1.call(InjectorImpl.java:997)
	at com.google.inject.internal.InjectorImpl.callInContext(InjectorImpl.java:1047)
	at com.google.inject.internal.InjectorImpl$2.get(InjectorImpl.java:993)
	at org.eclipse.sisu.inject.LazyBeanEntry.getValue(LazyBeanEntry.java:82)
	at org.eclipse.sisu.plexus.LazyPlexusBean.getValue(LazyPlexusBean.java:51)
	at org.codehaus.plexus.DefaultPlexusContainer.lookup(DefaultPlexusContainer.java:260)
	at org.codehaus.plexus.DefaultPlexusContainer.lookup(DefaultPlexusContainer.java:240)
	at org.codehaus.plexus.DefaultPlexusContainer.lookup(DefaultPlexusContainer.java:234)
	at org.apache.maven.plugins.site.AbstractSiteRenderingMojo.getReports(AbstractSiteRenderingMojo.java:234)
	at org.apache.maven.plugins.site.SiteMojo.execute(SiteMojo.java:121)
	at org.apache.maven.plugin.DefaultBuildPluginManager.executeMojo(DefaultBuildPluginManager.java:133)
	at org.apache.maven.lifecycle.internal.MojoExecutor.execute(MojoExecutor.java:208)
	at org.apache.maven.lifecycle.internal.MojoExecutor.execute(MojoExecutor.java:153)
	at org.apache.maven.lifecycle.internal.MojoExecutor.execute(MojoExecutor.java:145)
	at org.apache.maven.lifecycle.internal.LifecycleModuleBuilder.buildProject(LifecycleModuleBuilder.java:108)
	at org.apache.maven.lifecycle.internal.LifecycleModuleBuilder.buildProject(LifecycleModuleBuilder.java:76)
	at org.apache.maven.lifecycle.internal.builder.singlethreaded.SingleThreadedBuilder.build(SingleThreadedBuilder.java:51)
	at org.apache.maven.lifecycle.internal.LifecycleStarter.execute(LifecycleStarter.java:116)
	at org.apache.maven.DefaultMaven.doExecute(DefaultMaven.java:361)
	at org.apache.maven.DefaultMaven.execute(DefaultMaven.java:155)
	at org.jvnet.hudson.maven3.launcher.Maven31Launcher.main(Maven31Launcher.java:132)
	at sun.reflect.NativeMethodAccessorImpl.invoke0(Native Method)
	at sun.reflect.NativeMethodAccessorImpl.invoke(NativeMethodAccessorImpl.java:39)
	at sun.reflect.DelegatingMethodAccessorImpl.invoke(DelegatingMethodAccessorImpl.java:25)
	at java.lang.reflect.Method.invoke(Method.java:597)
	at org.codehaus.plexus.classworlds.launcher.Launcher.launchStandard(Launcher.java:330)
	at org.codehaus.plexus.classworlds.launcher.Launcher.launch(Launcher.java:238)
	at jenkins.maven3.agent.Maven31Main.launch(Maven31Main.java:181)
	at sun.reflect.NativeMethodAccessorImpl.invoke0(Native Method)
	at sun.reflect.NativeMethodAccessorImpl.invoke(NativeMethodAccessorImpl.java:39)
	at sun.reflect.DelegatingMethodAccessorImpl.invoke(DelegatingMethodAccessorImpl.java:25)
	at java.lang.reflect.Method.invoke(Method.java:597)
	at hudson.maven.Maven3Builder.call(Maven3Builder.java:134)
	at hudson.maven.Maven3Builder.call(Maven3Builder.java:69)
	at hudson.remoting.UserRequest.perform(UserRequest.java:118)
	at hudson.remoting.UserRequest.perform(UserRequest.java:48)
	at hudson.remoting.Request$2.run(Request.java:328)
	at hudson.remoting.InterceptingExecutorService$1.call(InterceptingExecutorService.java:72)
	at java.util.concurrent.FutureTask$Sync.innerRun(FutureTask.java:303)
	at java.util.concurrent.FutureTask.run(FutureTask.java:138)
	at java.util.concurrent.ThreadPoolExecutor$Worker.runTask(ThreadPoolExecutor.java:886)
	at java.util.concurrent.ThreadPoolExecutor$Worker.run(ThreadPoolExecutor.java:908)
	at java.lang.Thread.run(Thread.java:662)
Caused by: java.lang.ClassNotFoundException: org.sonatype.aether.graph.DependencyFilter
	at org.codehaus.plexus.classworlds.strategy.SelfFirstStrategy.loadClass(SelfFirstStrategy.java:50)
	at org.codehaus.plexus.classworlds.realm.ClassRealm.unsynchronizedLoadClass(ClassRealm.java:259)
	at org.codehaus.plexus.classworlds.realm.ClassRealm.loadClass(ClassRealm.java:242)
	at org.codehaus.plexus.classworlds.realm.ClassRealm.loadClass(ClassRealm.java:227)
	... 72 more
[JENKINS] Archiving site from /var/lib/jenkins/workspace/Geoprocessing-site/target/site to /var/lib/jenkins/jobs/Geoprocessing-site/site
log4j:WARN No appenders could be found for logger (org.apache.commons.beanutils.converters.BooleanConverter).
log4j:WARN Please initialize the log4j system properly.
[INFO] ------------------------------------------------------------------------
[INFO] BUILD FAILURE
[INFO] ------------------------------------------------------------------------
[INFO] Total time: 15.026 s
[INFO] Finished at: 2014-07-14T10:18:27+01:00
[INFO] Final Memory: 12M/52M
[INFO] ------------------------------------------------------------------------
Waiting for Jenkins to finish collecting data
[ERROR] Failed to execute goal org.apache.maven.plugins:maven-site-plugin:3.0:site (default-cli) on project 52n-geoprocessing-site: Execution default-cli of goal org.apache.maven.plugins:maven-site-plugin:3.0:site failed: A required class was missing while executing org.apache.maven.plugins:maven-site-plugin:3.0:site: org/sonatype/aether/graph/DependencyFilter
[ERROR] -----------------------------------------------------
[ERROR] realm =    plugin>org.apache.maven.plugins:maven-site-plugin:3.0
[ERROR] strategy = org.codehaus.plexus.classworlds.strategy.SelfFirstStrategy
[ERROR] urls[0] = file:/var/lib/jenkins/.m2/repository/org/apache/maven/plugins/maven-site-plugin/3.0/maven-site-plugin-3.0.jar
[ERROR] urls[1] = file:/var/lib/jenkins/.m2/repository/org/apache/maven/reporting/maven-reporting-exec/1.0.1/maven-reporting-exec-1.0.1.jar
[ERROR] urls[2] = file:/var/lib/jenkins/.m2/repository/org/apache/maven/reporting/maven-reporting-api/3.0/maven-reporting-api-3.0.jar
[ERROR] urls[3] = file:/var/lib/jenkins/.m2/repository/org/apache/velocity/velocity/1.5/velocity-1.5.jar
[ERROR] urls[4] = file:/var/lib/jenkins/.m2/repository/oro/oro/2.0.8/oro-2.0.8.jar
[ERROR] urls[5] = file:/var/lib/jenkins/.m2/repository/velocity/velocity/1.5/velocity-1.5.jar
[ERROR] urls[6] = file:/var/lib/jenkins/.m2/repository/org/sonatype/aether/aether-util/1.7/aether-util-1.7.jar
[ERROR] urls[7] = file:/var/lib/jenkins/.m2/repository/org/sonatype/sisu/sisu-inject-bean/1.4.2/sisu-inject-bean-1.4.2.jar
[ERROR] urls[8] = file:/var/lib/jenkins/.m2/repository/org/sonatype/sisu/sisu-guice/2.1.7/sisu-guice-2.1.7-noaop.jar
[ERROR] urls[9] = file:/var/lib/jenkins/.m2/repository/org/codehaus/plexus/plexus-interpolation/1.14/plexus-interpolation-1.14.jar
[JENKINS] Archiving /var/lib/jenkins/workspace/Geoprocessing-site/pom.xml to org.n52.wps/52n-geoprocessing-site/2.0.2/52n-geoprocessing-site-2.0.2.pom
[ERROR] urls[10] = file:/var/lib/jenkins/.m2/repository/org/codehaus/plexus/plexus-component-annotations/1.5.5/plexus-component-annotations-1.5.5.jar
[ERROR] urls[11] = file:/var/lib/jenkins/.m2/repository/org/sonatype/plexus/plexus-sec-dispatcher/1.3/plexus-sec-dispatcher-1.3.jar
[ERROR] urls[12] = file:/var/lib/jenkins/.m2/repository/org/sonatype/plexus/plexus-cipher/1.4/plexus-cipher-1.4.jar
[ERROR] urls[13] = file:/var/lib/jenkins/.m2/repository/org/apache/maven/doxia/doxia-sink-api/1.2/doxia-sink-api-1.2.jar
[ERROR] urls[14] = file:/var/lib/jenkins/.m2/repository/org/apache/maven/doxia/doxia-logging-api/1.2/doxia-logging-api-1.2.jar
[ERROR] urls[15] = file:/var/lib/jenkins/.m2/repository/junit/junit/3.8.1/junit-3.8.1.jar
[ERROR] urls[16] = file:/var/lib/jenkins/.m2/repository/org/apache/maven/doxia/doxia-core/1.2/doxia-core-1.2.jar
[ERROR] urls[17] = file:/var/lib/jenkins/.m2/repository/xerces/xercesImpl/2.9.1/xercesImpl-2.9.1.jar
[ERROR] urls[18] = file:/var/lib/jenkins/.m2/repository/xml-apis/xml-apis/1.3.04/xml-apis-1.3.04.jar
[ERROR] urls[19] = file:/var/lib/jenkins/.m2/repository/org/apache/httpcomponents/httpclient/4.0.2/httpclient-4.0.2.jar
[ERROR] urls[20] = file:/var/lib/jenkins/.m2/repository/org/apache/httpcomponents/httpcore/4.0.1/httpcore-4.0.1.jar
[ERROR] urls[21] = file:/var/lib/jenkins/.m2/repository/commons-codec/commons-codec/1.3/commons-codec-1.3.jar
[ERROR] urls[22] = file:/var/lib/jenkins/.m2/repository/org/apache/maven/doxia/doxia-module-xhtml/1.2/doxia-module-xhtml-1.2.jar
[ERROR] urls[23] = file:/var/lib/jenkins/.m2/repository/org/apache/maven/doxia/doxia-module-apt/1.2/doxia-module-apt-1.2.jar
[ERROR] urls[24] = file:/var/lib/jenkins/.m2/repository/org/apache/maven/doxia/doxia-module-xdoc/1.2/doxia-module-xdoc-1.2.jar
[ERROR] urls[25] = file:/var/lib/jenkins/.m2/repository/org/apache/maven/doxia/doxia-module-fml/1.2/doxia-module-fml-1.2.jar
[ERROR] urls[26] = file:/var/lib/jenkins/.m2/repository/javax/servlet/servlet-api/2.5/servlet-api-2.5.jar
[ERROR] urls[27] = file:/var/lib/jenkins/.m2/repository/org/apache/maven/doxia/doxia-decoration-model/1.2/doxia-decoration-model-1.2.jar
[ERROR] urls[28] = file:/var/lib/jenkins/.m2/repository/org/apache/maven/doxia/doxia-site-renderer/1.2/doxia-site-renderer-1.2.jar
[ERROR] urls[29] = file:/var/lib/jenkins/.m2/repository/commons-collections/commons-collections/3.2.1/commons-collections-3.2.1.jar
[ERROR] urls[30] = file:/var/lib/jenkins/.m2/repository/org/apache/maven/shared/maven-doxia-tools/1.4/maven-doxia-tools-1.4.jar
[ERROR] urls[31] = file:/var/lib/jenkins/.m2/repository/org/codehaus/plexus/plexus-archiver/1.0/plexus-archiver-1.0.jar
[ERROR] urls[32] = file:/var/lib/jenkins/.m2/repository/org/codehaus/plexus/plexus-io/1.0/plexus-io-1.0.jar
[ERROR] urls[33] = file:/var/lib/jenkins/.m2/repository/org/codehaus/plexus/plexus-i18n/1.0-beta-7/plexus-i18n-1.0-beta-7.jar
[ERROR] urls[34] = file:/var/lib/jenkins/.m2/repository/org/codehaus/plexus/plexus-velocity/1.1.8/plexus-velocity-1.1.8.jar
[ERROR] urls[35] = file:/var/lib/jenkins/.m2/repository/org/codehaus/plexus/plexus-utils/1.5.10/plexus-utils-1.5.10.jar
[ERROR] urls[36] = file:/var/lib/jenkins/.m2/repository/org/mortbay/jetty/jetty/6.1.25/jetty-6.1.25.jar
[ERROR] urls[37] = file:/var/lib/jenkins/.m2/repository/org/mortbay/jetty/servlet-api/2.5-20081211/servlet-api-2.5-20081211.jar
[ERROR] urls[38] = file:/var/lib/jenkins/.m2/repository/org/mortbay/jetty/jetty-util/6.1.25/jetty-util-6.1.25.jar
[ERROR] urls[39] = file:/var/lib/jenkins/.m2/repository/commons-lang/commons-lang/2.5/commons-lang-2.5.jar
[ERROR] urls[40] = file:/var/lib/jenkins/.m2/repository/commons-io/commons-io/1.4/commons-io-1.4.jar
[ERROR] Number of foreign imports: 1
[ERROR] import: Entry[import  from realm ClassRealm[project>org.n52.wps:52n-geoprocessing-site:2.0.2, parent: ClassRealm[maven.api, parent: null]]]
[ERROR] 
[ERROR] -----------------------------------------------------: org.sonatype.aether.graph.DependencyFilter
[ERROR] -> [Help 1]
[ERROR] 
[ERROR] To see the full stack trace of the errors, re-run Maven with the -e switch.
[ERROR] Re-run Maven using the -X switch to enable full debug logging.
[ERROR] 
[ERROR] For more information about the errors and possible solutions, please read the following articles:
[ERROR] [Help 1] http://cwiki.apache.org/confluence/display/MAVEN/AetherClassNotFound
Sending e-mails to: b.pross@52north.org
channel stopped
Sending e-mails to: b.pross@52north.org
Finished: FAILURE