FailedConsole Output

Started by user HenningBredel
Building in workspace /var/lib/jenkins/workspace/52n-sps 2.0.1 RELEASE
Updating https://svn.52north.org/svn/swe/main/SPS/Services/trunk at revision '2013-06-13T14:29:07.828 +0200'
At revision 20844
no change for https://svn.52north.org/svn/swe/main/SPS/Services/trunk since the previous build
Parsing POMs
Modules changed, recalculating dependency graph
[52n-sps 2.0.1 RELEASE] $ java -Xmx512m -XX:MaxPermSize=512m -cp /var/lib/jenkins/plugins/maven-plugin/WEB-INF/lib/maven3-agent-1.2.jar:/var/lib/jenkins/tools/hudson.tasks.Maven_MavenInstallation/Maven_3.0.x/boot/plexus-classworlds-2.4.jar org.jvnet.hudson.maven3.agent.Maven3Main /var/lib/jenkins/tools/hudson.tasks.Maven_MavenInstallation/Maven_3.0.x /var/cache/jenkins/war/WEB-INF/lib/remoting-2.22.jar /var/lib/jenkins/plugins/maven-plugin/WEB-INF/lib/maven3-interceptor-1.2.jar 56523
<===[JENKINS REMOTING CAPACITY]===>channel started
log4j:WARN No appenders could be found for logger (org.apache.commons.beanutils.converters.BooleanConverter).
log4j:WARN Please initialize the log4j system properly.
Executing Maven:  -B -f /var/lib/jenkins/workspace/52n-sps 2.0.1 RELEASE/pom.xml -DdevelopmentVersion=2.0.2-SNAPSHOT -DreleaseVersion=2.0.1 -Dusername=HenningBredel -Dpassword=********* -Dresume=false release:prepare release:perform
[INFO] Scanning for projects...
[INFO] ------------------------------------------------------------------------
[INFO] Reactor Build Order:
[INFO] 
[INFO] 52North SPS
[INFO] 52North SPS API XML Binding
[INFO] 52North SPS API
[INFO] 52North SPS core
[INFO] 52North SPS Admin
[INFO] 52North SPS Hibernate
[INFO] 52North SPS Test Plugin
[INFO] 52North SPS webapp
[INFO]                                                                         
[INFO] ------------------------------------------------------------------------
[INFO] Building 52North SPS 2.0.1
[INFO] ------------------------------------------------------------------------
[INFO] 
[INFO] --- maven-release-plugin:2.1:prepare (default-cli) @ 52n-sps ---
[INFO] ------------------------------------------------------------------------
[INFO] Reactor Summary:
[INFO] 
[INFO] 52North SPS ....................................... FAILURE [2.114s]
[INFO] 52North SPS API XML Binding ....................... SKIPPED
[INFO] 52North SPS API ................................... SKIPPED
[INFO] 52North SPS core .................................. SKIPPED
[INFO] 52North SPS Admin ................................. SKIPPED
[INFO] 52North SPS Hibernate ............................. SKIPPED
[INFO] 52North SPS Test Plugin ........................... SKIPPED
[INFO] 52North SPS webapp ................................ SKIPPED
[INFO] ------------------------------------------------------------------------
[INFO] BUILD FAILURE
[INFO] ------------------------------------------------------------------------
[INFO] Total time: 2.807s
[INFO] Finished at: Thu Jun 13 14:29:14 CEST 2013
[INFO] Final Memory: 7M/91M
[INFO] ------------------------------------------------------------------------
[JENKINS] Archiving /var/lib/jenkins/workspace/52n-sps 2.0.1 RELEASE/52n-sps-webapp/pom.xml to /var/lib/jenkins/jobs/52n-sps 2.0.1 RELEASE/modules/org.n52.sensorweb$52n-sps-webapp/builds/2013-06-13_14-29-09/archive/org.n52.sensorweb/52n-sps-webapp/2.0.1/52n-sps-webapp-2.0.1.pom
[JENKINS] Archiving /var/lib/jenkins/workspace/52n-sps 2.0.1 RELEASE/52n-sps-api/pom.xml to /var/lib/jenkins/jobs/52n-sps 2.0.1 RELEASE/modules/org.n52.sensorweb$52n-sps-api/builds/2013-06-13_14-29-09/archive/org.n52.sensorweb/52n-sps-api/2.0.1/52n-sps-api-2.0.1.pom
[JENKINS] Archiving /var/lib/jenkins/workspace/52n-sps 2.0.1 RELEASE/pom.xml to /var/lib/jenkins/jobs/52n-sps 2.0.1 RELEASE/modules/org.n52.sensorweb$52n-sps/builds/2013-06-13_14-29-09/archive/org.n52.sensorweb/52n-sps/2.0.1/52n-sps-2.0.1.pom
[JENKINS] Archiving /var/lib/jenkins/workspace/52n-sps 2.0.1 RELEASE/52n-sps-hibernate/pom.xml to /var/lib/jenkins/jobs/52n-sps 2.0.1 RELEASE/modules/org.n52.sensorweb$52n-sps-hibernate/builds/2013-06-13_14-29-09/archive/org.n52.sensorweb/52n-sps-hibernate/2.0.1/52n-sps-hibernate-2.0.1.pom
[JENKINS] Archiving /var/lib/jenkins/workspace/52n-sps 2.0.1 RELEASE/52n-sps-admin/pom.xml to /var/lib/jenkins/jobs/52n-sps 2.0.1 RELEASE/modules/org.n52.sensorweb$52n-sps-admin/builds/2013-06-13_14-29-09/archive/org.n52.sensorweb/52n-sps-admin/2.0.1/52n-sps-admin-2.0.1.pom
[JENKINS] Archiving /var/lib/jenkins/workspace/52n-sps 2.0.1 RELEASE/52n-sps-testplugin/pom.xml to /var/lib/jenkins/jobs/52n-sps 2.0.1 RELEASE/modules/org.n52.sensorweb$52n-sps-testplugin/builds/2013-06-13_14-29-09/archive/org.n52.sensorweb/52n-sps-testplugin/2.0.1/52n-sps-testplugin-2.0.1.pom
[JENKINS] Archiving /var/lib/jenkins/workspace/52n-sps 2.0.1 RELEASE/52n-sps-core/pom.xml to /var/lib/jenkins/jobs/52n-sps 2.0.1 RELEASE/modules/org.n52.sensorweb$52n-sps-core/builds/2013-06-13_14-29-09/archive/org.n52.sensorweb/52n-sps-core/2.0.1/52n-sps-core-2.0.1.pom
[JENKINS] Archiving /var/lib/jenkins/workspace/52n-sps 2.0.1 RELEASE/52n-sps-api-xml/pom.xml to /var/lib/jenkins/jobs/52n-sps 2.0.1 RELEASE/modules/org.n52.sensorweb$52n-sps-api-xml/builds/2013-06-13_14-29-09/archive/org.n52.sensorweb/52n-sps-api-xml/2.0.1/52n-sps-api-xml-2.0.1.pom
Waiting for Jenkins to finish collecting data
mavenExecutionResult exceptions not empty
message : Failed to execute goal org.apache.maven.plugins:maven-release-plugin:2.1:prepare (default-cli) on project 52n-sps: You don't have a SNAPSHOT project in the reactor projects list.
cause : You don't have a SNAPSHOT project in the reactor projects list.
Stack trace : 
org.apache.maven.lifecycle.LifecycleExecutionException: Failed to execute goal org.apache.maven.plugins:maven-release-plugin:2.1:prepare (default-cli) on project 52n-sps: You don't have a SNAPSHOT project in the reactor projects list.
	at org.apache.maven.lifecycle.internal.MojoExecutor.execute(MojoExecutor.java:213)
	at org.apache.maven.lifecycle.internal.MojoExecutor.execute(MojoExecutor.java:153)
	at org.apache.maven.lifecycle.internal.MojoExecutor.execute(MojoExecutor.java:145)
	at org.apache.maven.lifecycle.internal.LifecycleModuleBuilder.buildProject(LifecycleModuleBuilder.java:84)
	at org.apache.maven.lifecycle.internal.LifecycleModuleBuilder.buildProject(LifecycleModuleBuilder.java:59)
	at org.apache.maven.lifecycle.internal.LifecycleStarter.singleThreadedBuild(LifecycleStarter.java:183)
	at org.apache.maven.lifecycle.internal.LifecycleStarter.execute(LifecycleStarter.java:161)
	at org.apache.maven.DefaultMaven.doExecute(DefaultMaven.java:320)
	at org.apache.maven.DefaultMaven.execute(DefaultMaven.java:156)
	at org.jvnet.hudson.maven3.launcher.Maven3Launcher.main(Maven3Launcher.java:79)
	at sun.reflect.NativeMethodAccessorImpl.invoke0(Native Method)
	at sun.reflect.NativeMethodAccessorImpl.invoke(NativeMethodAccessorImpl.java:39)
	at sun.reflect.DelegatingMethodAccessorImpl.invoke(DelegatingMethodAccessorImpl.java:25)
	at java.lang.reflect.Method.invoke(Method.java:597)
	at org.codehaus.plexus.classworlds.launcher.Launcher.launchStandard(Launcher.java:329)
	at org.codehaus.plexus.classworlds.launcher.Launcher.launch(Launcher.java:239)
	at org.jvnet.hudson.maven3.agent.Maven3Main.launch(Maven3Main.java:158)
	at hudson.maven.Maven3Builder.call(Maven3Builder.java:100)
	at hudson.maven.Maven3Builder.call(Maven3Builder.java:66)
	at hudson.remoting.UserRequest.perform(UserRequest.java:118)
	at hudson.remoting.UserRequest.perform(UserRequest.java:48)
	at hudson.remoting.Request$2.run(Request.java:326)
	at hudson.remoting.InterceptingExecutorService$1.call(InterceptingExecutorService.java:72)
	at java.util.concurrent.FutureTask$Sync.innerRun(FutureTask.java:303)
	at java.util.concurrent.FutureTask.run(FutureTask.java:138)
	at java.util.concurrent.ThreadPoolExecutor$Worker.runTask(ThreadPoolExecutor.java:886)
	at java.util.concurrent.ThreadPoolExecutor$Worker.run(ThreadPoolExecutor.java:908)
	at java.lang.Thread.run(Thread.java:662)
Caused by: org.apache.maven.plugin.MojoFailureException: You don't have a SNAPSHOT project in the reactor projects list.
	at org.apache.maven.plugins.release.PrepareReleaseMojo.prepareRelease(PrepareReleaseMojo.java:287)
	at org.apache.maven.plugins.release.PrepareReleaseMojo.execute(PrepareReleaseMojo.java:237)
	at org.apache.maven.plugin.DefaultBuildPluginManager.executeMojo(DefaultBuildPluginManager.java:101)
	at org.apache.maven.lifecycle.internal.MojoExecutor.execute(MojoExecutor.java:209)
	... 27 more
Caused by: org.apache.maven.shared.release.ReleaseFailureException: You don't have a SNAPSHOT project in the reactor projects list.
	at org.apache.maven.shared.release.phase.CheckPomPhase.execute(CheckPomPhase.java:111)
	at org.apache.maven.shared.release.DefaultReleaseManager.prepare(DefaultReleaseManager.java:203)
	at org.apache.maven.shared.release.DefaultReleaseManager.prepare(DefaultReleaseManager.java:140)
	at org.apache.maven.shared.release.DefaultReleaseManager.prepare(DefaultReleaseManager.java:103)
	at org.apache.maven.plugins.release.PrepareReleaseMojo.prepareRelease(PrepareReleaseMojo.java:279)
	... 30 more
Sending e-mails to: sensorweb-commits@52north.org
channel stopped
Skipping sonar analysis due to bad build status FAILURE
Sending e-mails to: sensorweb-commits@52north.org
Finished: FAILURE