FailedConsole Output

Started by user BenjaminPross
Building in workspace /var/lib/jenkins/workspace/52n-release-test
 > git rev-parse --is-inside-work-tree # timeout=10
Fetching changes from the remote Git repository
 > git config remote.origin.url https://github.com/bpross-52n/release-test.git # timeout=10
Fetching upstream changes from https://github.com/bpross-52n/release-test.git
 > git --version # timeout=10
 > git fetch --tags --progress https://github.com/bpross-52n/release-test.git +refs/heads/*:refs/remotes/origin/*
 > git rev-parse origin/master^{commit} # timeout=10
Checking out Revision 270b79b358888924096f5d08386e381a2488c4ad (origin/master)
 > git config core.sparsecheckout # timeout=10
 > git checkout -f 270b79b358888924096f5d08386e381a2488c4ad
Commit message: "Use default packaging"
 > git rev-list a05d3b7089d59b717ec222eb175cdbee5df11ca7 # timeout=10
 > git tag -a -f -m Jenkins Build #16 jenkins-52n-release-test-16 # timeout=10
Parsing POMs
Established TCP socket on 54241
[52n-release-test] $ /var/lib/jenkins/tools/hudson.model.JDK/Java-1.8/bin/java -Xmx1024m -XX:MaxPermSize=1024m -cp /var/lib/jenkins/plugins/maven-plugin/WEB-INF/lib/maven33-agent-1.12-alpha-1.jar:/var/lib/jenkins/tools/hudson.tasks.Maven_MavenInstallation/Maven_3.x/boot/plexus-classworlds-2.5.2.jar:/var/lib/jenkins/tools/hudson.tasks.Maven_MavenInstallation/Maven_3.x/conf/logging jenkins.maven3.agent.Maven33Main /var/lib/jenkins/tools/hudson.tasks.Maven_MavenInstallation/Maven_3.x /var/cache/jenkins/war/WEB-INF/lib/remoting-3.14.jar /var/lib/jenkins/plugins/maven-plugin/WEB-INF/lib/maven33-interceptor-1.12-alpha-1.jar /var/lib/jenkins/plugins/maven-plugin/WEB-INF/lib/maven3-interceptor-commons-1.12-alpha-1.jar 54241
Java HotSpot(TM) 64-Bit Server VM warning: ignoring option MaxPermSize=1024m; support was removed in 8.0
<===[JENKINS REMOTING CAPACITY]===>channel started
Executing Maven:  -B -f /var/lib/jenkins/workspace/52n-release-test/pom.xml clean install deploy
[INFO] Scanning for projects...
[INFO]                                                                         
[INFO] ------------------------------------------------------------------------
[INFO] Building 52n-Release-Test 1.0.7-SNAPSHOT
[INFO] ------------------------------------------------------------------------
[INFO] 
[INFO] --- maven-clean-plugin:3.0.0:clean (default-clean) @ 52n-release-test ---
[INFO] Deleting /var/lib/jenkins/workspace/52n-release-test/target
[INFO] 
[INFO] --- git-commit-id-plugin:2.2.1:revision (default) @ 52n-release-test ---
[INFO] 
[INFO] --- maven-enforcer-plugin:1.4.1:enforce (default) @ 52n-release-test ---
[INFO] 
[INFO] --- whitespace-maven-plugin:1.0.4:trim (default) @ 52n-release-test ---
[INFO] 
[INFO] --- maven-resources-plugin:3.0.1:resources (default-resources) @ 52n-release-test ---
[INFO] Using 'UTF-8' encoding to copy filtered resources.
[INFO] skip non existing resourceDirectory /var/lib/jenkins/workspace/52n-release-test/src/main/resources
[INFO] 
[INFO] --- maven-compiler-plugin:3.6.0:compile (default-compile) @ 52n-release-test ---
[INFO] No sources to compile
[INFO] 
[INFO] --- maven-resources-plugin:3.0.1:testResources (default-testResources) @ 52n-release-test ---
[INFO] Using 'UTF-8' encoding to copy filtered resources.
[INFO] skip non existing resourceDirectory /var/lib/jenkins/workspace/52n-release-test/src/test/resources
[INFO] 
[INFO] --- maven-compiler-plugin:3.6.0:testCompile (default-testCompile) @ 52n-release-test ---
[INFO] No sources to compile
[INFO] 
[INFO] --- maven-surefire-plugin:2.19.1:test (default-test) @ 52n-release-test ---
[INFO] No tests to run.
[JENKINS] Recording test results
[INFO] 
[INFO] --- maven-jar-plugin:3.0.2:jar (default-jar) @ 52n-release-test ---
[WARNING] JAR will be empty - no content was marked for inclusion!
[INFO] Building jar: /var/lib/jenkins/workspace/52n-release-test/target/52n-release-test-1.0.7-SNAPSHOT.jar
[INFO] 
[INFO] >>> maven-source-plugin:3.0.1:jar (default) > generate-sources @ 52n-release-test >>>
[INFO] 
[INFO] --- git-commit-id-plugin:2.2.1:revision (default) @ 52n-release-test ---
[INFO] 
[INFO] --- maven-enforcer-plugin:1.4.1:enforce (default) @ 52n-release-test ---
[WARNING] Failed to getClass for org.apache.maven.plugins.source.SourceJarMojo
[INFO] 
[INFO] <<< maven-source-plugin:3.0.1:jar (default) < generate-sources @ 52n-release-test <<<
[INFO] 
[INFO] --- maven-source-plugin:3.0.1:jar (default) @ 52n-release-test ---
[INFO] No sources in project. Archive not created.
[INFO] 
[INFO] --- maven-javadoc-plugin:2.10.4:jar (default) @ 52n-release-test ---
[INFO] 
[INFO] --- maven-dependency-plugin:2.10:analyze-only (analyze-dependencies) @ 52n-release-test ---
[INFO] No dependency problems found
[INFO] 
[INFO] --- maven-install-plugin:2.5.2:install (default-install) @ 52n-release-test ---
[INFO] Installing /var/lib/jenkins/workspace/52n-release-test/target/52n-release-test-1.0.7-SNAPSHOT.jar to /var/lib/jenkins/.m2/repository/org/n52/wps/52n-release-test/1.0.7-SNAPSHOT/52n-release-test-1.0.7-SNAPSHOT.jar
[INFO] Installing /var/lib/jenkins/workspace/52n-release-test/pom.xml to /var/lib/jenkins/.m2/repository/org/n52/wps/52n-release-test/1.0.7-SNAPSHOT/52n-release-test-1.0.7-SNAPSHOT.pom
[INFO] 
[INFO] --- git-commit-id-plugin:2.2.1:revision (default) @ 52n-release-test ---
[INFO] 
[INFO] --- maven-enforcer-plugin:1.4.1:enforce (default) @ 52n-release-test ---
[INFO] 
[INFO] --- whitespace-maven-plugin:1.0.4:trim (default) @ 52n-release-test ---
[INFO] 
[INFO] --- maven-resources-plugin:3.0.1:resources (default-resources) @ 52n-release-test ---
[INFO] Using 'UTF-8' encoding to copy filtered resources.
[INFO] skip non existing resourceDirectory /var/lib/jenkins/workspace/52n-release-test/src/main/resources
[INFO] 
[INFO] --- maven-compiler-plugin:3.6.0:compile (default-compile) @ 52n-release-test ---
[INFO] No sources to compile
[INFO] 
[INFO] --- maven-resources-plugin:3.0.1:testResources (default-testResources) @ 52n-release-test ---
[INFO] Using 'UTF-8' encoding to copy filtered resources.
[INFO] skip non existing resourceDirectory /var/lib/jenkins/workspace/52n-release-test/src/test/resources
[INFO] 
[INFO] --- maven-compiler-plugin:3.6.0:testCompile (default-testCompile) @ 52n-release-test ---
[INFO] No sources to compile
[INFO] 
[INFO] --- maven-surefire-plugin:2.19.1:test (default-test) @ 52n-release-test ---
[INFO] No tests to run.
[INFO] Skipping execution of surefire because it has already been run for this configuration
[JENKINS] Recording test results
[INFO] 
[INFO] --- maven-jar-plugin:3.0.2:jar (default-jar) @ 52n-release-test ---
[WARNING] JAR will be empty - no content was marked for inclusion!
[INFO] ------------------------------------------------------------------------
[INFO] BUILD FAILURE
[INFO] ------------------------------------------------------------------------
[INFO] Total time: 3.797 s
[INFO] Finished at: 2017-12-06T14:46:12+00:00
[JENKINS] Archiving /var/lib/jenkins/workspace/52n-release-test/pom.xml to org.n52.wps/52n-release-test/1.0.7-SNAPSHOT/52n-release-test-1.0.7-SNAPSHOT.pom
[JENKINS] Archiving /var/lib/jenkins/workspace/52n-release-test/target/52n-release-test-1.0.7-SNAPSHOT.jar to org.n52.wps/52n-release-test/1.0.7-SNAPSHOT/52n-release-test-1.0.7-SNAPSHOT.jar
[INFO] Final Memory: 30M/277M
[INFO] ------------------------------------------------------------------------
[ERROR] Failed to execute goal org.apache.maven.plugins:maven-jar-plugin:3.0.2:jar (default-jar) on project 52n-release-test: You have to use a classifier to attach supplemental artifacts to the project instead of replacing them. -> [Help 1]
[ERROR] 
[ERROR] To see the full stack trace of the errors, re-run Maven with the -e switch.
[ERROR] Re-run Maven using the -X switch to enable full debug logging.
[ERROR] 
[ERROR] For more information about the errors and possible solutions, please read the following articles:
[ERROR] [Help 1] http://cwiki.apache.org/confluence/display/MAVEN/MojoExecutionException
Sending e-mails to: b.pross@52north.org
channel stopped
Sending e-mails to: b.pross@52north.org
Finished: FAILURE